Uploaded image for project: 'Flink'
  1. Flink
  2. FLINK-24800

BufferTimeoutITCase.testDisablingBufferTimeout failed on Azure

Agile BoardRank to TopRank to BottomAttach filesAttach ScreenshotBulk Copy AttachmentsBulk Move AttachmentsVotersWatch issueWatchersCreate sub-taskConvert to sub-taskLinkCloneLabelsUpdate Comment AuthorReplace String in CommentUpdate Comment VisibilityDelete Comments
    XMLWordPrintableJSON

Details

    Description

      2021-11-05T12:18:50.5272055Z Nov 05 12:18:50 [INFO] Results:
      2021-11-05T12:18:50.5273369Z Nov 05 12:18:50 [INFO] 
      2021-11-05T12:18:50.5274011Z Nov 05 12:18:50 [ERROR] Failures: 
      2021-11-05T12:18:50.5274518Z Nov 05 12:18:50 [ERROR]   BufferTimeoutITCase.testDisablingBufferTimeout:85 
      2021-11-05T12:18:50.5274871Z Nov 05 12:18:50 Expected: <0>
      2021-11-05T12:18:50.5275150Z Nov 05 12:18:50      but: was <1>
      2021-11-05T12:18:50.5276136Z Nov 05 12:18:50 [INFO] 
      2021-11-05T12:18:50.5276667Z Nov 05 12:18:50 [ERROR] Tests run: 1849, Failures: 1, Errors: 0, Skipped: 58
      

      https://dev.azure.com/apache-flink/apache-flink/_build/results?buildId=26018&view=logs&j=a57e0635-3fad-5b08-57c7-a4142d7d6fa9&t=2ef0effc-1da1-50e5-c2bd-aab434b1c5b7&l=10850

      Attachments

        Activity

          This comment will be Viewable by All Users Viewable by All Users
          Cancel

          People

            akalashnikov Anton Kalashnikov
            gaoyunhaii Yun Gao
            Votes:
            0 Vote for this issue
            Watchers:
            7 Start watching this issue

            Dates

              Created:
              Updated:
              Resolved:

              Slack

                Issue deployment