Uploaded image for project: 'Flink'
  1. Flink
  2. FLINK-24482

KafkaShuffleTestBase.testMetrics fails on Azure

    XMLWordPrintableJSON

Details

    Description

      The test KafkaShuffleTestBase.testMetrics fails with

      Oct 06 17:30:40 [ERROR] Tests run: 1, Failures: 1, Errors: 0, Skipped: 0, Time elapsed: 33.966 s <<< FAILURE! - in org.apache.flink.streaming.connectors.kafka.shuffle.KafkaShuffleTestBase
      Oct 06 17:30:40 [ERROR] testMetrics(org.apache.flink.streaming.connectors.kafka.shuffle.KafkaShuffleTestBase)  Time elapsed: 2.948 s  <<< FAILURE!
      Oct 06 17:30:40 java.lang.AssertionError: expected:<14716> but was:<14206>
      Oct 06 17:30:40 	at org.junit.Assert.fail(Assert.java:88)
      Oct 06 17:30:40 	at org.junit.Assert.failNotEquals(Assert.java:834)
      Oct 06 17:30:40 	at org.junit.Assert.assertEquals(Assert.java:645)
      Oct 06 17:30:40 	at org.junit.Assert.assertEquals(Assert.java:631)
      Oct 06 17:30:40 	at org.apache.flink.streaming.connectors.kafka.KafkaConsumerTestBase.runMetricsTest(KafkaConsumerTestBase.java:1892)
      Oct 06 17:30:40 	at org.apache.flink.streaming.connectors.kafka.KafkaConsumerTestBase.testMetrics(KafkaConsumerTestBase.java:1808)
      Oct 06 17:30:40 	at sun.reflect.NativeMethodAccessorImpl.invoke0(Native Method)
      Oct 06 17:30:40 	at sun.reflect.NativeMethodAccessorImpl.invoke(NativeMethodAccessorImpl.java:62)
      Oct 06 17:30:40 	at sun.reflect.DelegatingMethodAccessorImpl.invoke(DelegatingMethodAccessorImpl.java:43)
      Oct 06 17:30:40 	at java.lang.reflect.Method.invoke(Method.java:498)
      Oct 06 17:30:40 	at org.junit.runners.model.FrameworkMethod$1.runReflectiveCall(FrameworkMethod.java:50)
      Oct 06 17:30:40 	at org.junit.internal.runners.model.ReflectiveCallable.run(ReflectiveCallable.java:12)
      Oct 06 17:30:40 	at org.junit.runners.model.FrameworkMethod.invokeExplosively(FrameworkMethod.java:47)
      Oct 06 17:30:40 	at org.junit.internal.runners.statements.InvokeMethod.evaluate(InvokeMethod.java:17)
      Oct 06 17:30:40 	at org.junit.internal.runners.statements.RunBefores.evaluate(RunBefores.java:26)
      Oct 06 17:30:40 	at org.apache.flink.util.TestNameProvider$1.evaluate(TestNameProvider.java:45)
      Oct 06 17:30:40 	at org.junit.rules.TestWatcher$1.evaluate(TestWatcher.java:55)
      Oct 06 17:30:40 	at org.junit.rules.RunRules.evaluate(RunRules.java:20)
      Oct 06 17:30:40 	at org.junit.runners.ParentRunner.runLeaf(ParentRunner.java:325)
      Oct 06 17:30:40 	at org.junit.runners.BlockJUnit4ClassRunner.runChild(BlockJUnit4ClassRunner.java:78)
      Oct 06 17:30:40 	at org.junit.runners.BlockJUnit4ClassRunner.runChild(BlockJUnit4ClassRunner.java:57)
      Oct 06 17:30:40 	at org.junit.runners.ParentRunner$3.run(ParentRunner.java:290)
      Oct 06 17:30:40 	at org.junit.runners.ParentRunner$1.schedule(ParentRunner.java:71)
      Oct 06 17:30:40 	at org.junit.runners.ParentRunner.runChildren(ParentRunner.java:288)
      Oct 06 17:30:40 	at org.junit.runners.ParentRunner.access$000(ParentRunner.java:58)
      Oct 06 17:30:40 	at org.junit.runners.ParentRunner$2.evaluate(ParentRunner.java:268)
      Oct 06 17:30:40 	at org.junit.internal.runners.statements.RunBefores.evaluate(RunBefores.java:26)
      Oct 06 17:30:40 	at org.junit.internal.runners.statements.RunAfters.evaluate(RunAfters.java:27)
      Oct 06 17:30:40 	at org.junit.rules.ExternalResource$1.evaluate(ExternalResource.java:48)
      Oct 06 17:30:40 	at org.junit.rules.ExternalResource$1.evaluate(ExternalResource.java:48)
      Oct 06 17:30:40 	at org.junit.rules.RunRules.evaluate(RunRules.java:20)
      Oct 06 17:30:40 	at org.junit.runners.ParentRunner.run(ParentRunner.java:363)
      Oct 06 17:30:40 	at org.apache.maven.surefire.junit4.JUnit4Provider.execute(JUnit4Provider.java:365)
      Oct 06 17:30:40 	at org.apache.maven.surefire.junit4.JUnit4Provider.executeWithRerun(JUnit4Provider.java:273)
      Oct 06 17:30:40 	at org.apache.maven.surefire.junit4.JUnit4Provider.executeTestSet(JUnit4Provider.java:238)
      Oct 06 17:30:40 	at org.apache.maven.surefire.junit4.JUnit4Provider.invoke(JUnit4Provider.java:159)
      Oct 06 17:30:40 	at org.apache.maven.surefire.booter.ForkedBooter.invokeProviderInSameClassLoader(ForkedBooter.java:384)
      Oct 06 17:30:40 	at org.apache.maven.surefire.booter.ForkedBooter.runSuitesInProcess(ForkedBooter.java:345)
      Oct 06 17:30:40 	at org.apache.maven.surefire.booter.ForkedBooter.execute(ForkedBooter.java:126)
      Oct 06 17:30:40 	at org.apache.maven.surefire.booter.ForkedBooter.main(ForkedBooter.java:418)
      

      https://dev.azure.com/ververica-dev/daplatform-flink/_build/results?buildId=1549&view=logs&j=d543d572-9428-5803-a30c-e8e09bf70915&t=18a8058f-13c3-5857-f389-32cb0ee00ed2&l=6507

      Attachments

        Activity

          People

            Unassigned Unassigned
            trohrmann Till Rohrmann
            Votes:
            0 Vote for this issue
            Watchers:
            2 Start watching this issue

            Dates

              Created:
              Updated: