Uploaded image for project: 'Flink'
  1. Flink
  2. FLINK-23696

RMQSourceTest.testRedeliveredSessionIDsAck fails on azure

    XMLWordPrintableJSON

    Details

      Description

      https://dev.azure.com/apache-flink/apache-flink/_build/results?buildId=21792&view=logs&j=e1276d0f-df12-55ec-86b5-c0ad597d83c9&t=906e9244-f3be-5604-1979-e767c8a6f6d9&l=13297

      Aug 10 01:15:35 [ERROR] Tests run: 16, Failures: 1, Errors: 0, Skipped: 0, Time elapsed: 3.181 s <<< FAILURE! - in org.apache.flink.streaming.connectors.rabbitmq.RMQSourceTest
      Aug 10 01:15:35 [ERROR] testRedeliveredSessionIDsAck(org.apache.flink.streaming.connectors.rabbitmq.RMQSourceTest)  Time elapsed: 0.269 s  <<< FAILURE!
      Aug 10 01:15:35 java.lang.AssertionError: expected:<25> but was:<27>
      Aug 10 01:15:35 	at org.junit.Assert.fail(Assert.java:88)
      Aug 10 01:15:35 	at org.junit.Assert.failNotEquals(Assert.java:834)
      Aug 10 01:15:35 	at org.junit.Assert.assertEquals(Assert.java:645)
      Aug 10 01:15:35 	at org.junit.Assert.assertEquals(Assert.java:631)
      Aug 10 01:15:35 	at org.apache.flink.streaming.connectors.rabbitmq.RMQSourceTest.testRedeliveredSessionIDsAck(RMQSourceTest.java:407)
      Aug 10 01:15:35 	at sun.reflect.NativeMethodAccessorImpl.invoke0(Native Method)
      Aug 10 01:15:35 	at sun.reflect.NativeMethodAccessorImpl.invoke(NativeMethodAccessorImpl.java:62)
      Aug 10 01:15:35 	at sun.reflect.DelegatingMethodAccessorImpl.invoke(DelegatingMethodAccessorImpl.java:43)
      Aug 10 01:15:35 	at java.lang.reflect.Method.invoke(Method.java:498)
      Aug 10 01:15:35 	at org.junit.runners.model.FrameworkMethod$1.runReflectiveCall(FrameworkMethod.java:50)
      Aug 10 01:15:35 	at org.junit.internal.runners.model.ReflectiveCallable.run(ReflectiveCallable.java:12)
      Aug 10 01:15:35 	at org.junit.runners.model.FrameworkMethod.invokeExplosively(FrameworkMethod.java:47)
      Aug 10 01:15:35 	at org.junit.internal.runners.statements.InvokeMethod.evaluate(InvokeMethod.java:17)
      Aug 10 01:15:35 	at org.junit.internal.runners.statements.RunBefores.evaluate(RunBefores.java:26)
      Aug 10 01:15:35 	at org.junit.internal.runners.statements.RunAfters.evaluate(RunAfters.java:27)
      Aug 10 01:15:35 	at org.junit.rules.ExpectedException$ExpectedExceptionStatement.evaluate(ExpectedException.java:239)
      Aug 10 01:15:35 	at org.junit.rules.RunRules.evaluate(RunRules.java:20)
      Aug 10 01:15:35 	at org.junit.runners.ParentRunner.runLeaf(ParentRunner.java:325)
      Aug 10 01:15:35 	at org.junit.runners.BlockJUnit4ClassRunner.runChild(BlockJUnit4ClassRunner.java:78)
      Aug 10 01:15:35 	at org.junit.runners.BlockJUnit4ClassRunner.runChild(BlockJUnit4ClassRunner.java:57)
      Aug 10 01:15:35 	at org.junit.runners.ParentRunner$3.run(ParentRunner.java:290)
      Aug 10 01:15:35 	at org.junit.runners.ParentRunner$1.schedule(ParentRunner.java:71)
      Aug 10 01:15:35 	at org.junit.runners.ParentRunner.runChildren(ParentRunner.java:288)
      Aug 10 01:15:35 	at org.junit.runners.ParentRunner.access$000(ParentRunner.java:58)
      Aug 10 01:15:35 	at org.junit.runners.ParentRunner$2.evaluate(ParentRunner.java:268)
      Aug 10 01:15:35 	at org.junit.runners.ParentRunner.run(ParentRunner.java:363)
      Aug 10 01:15:35 	at org.apache.maven.surefire.junit4.JUnit4Provider.execute(JUnit4Provider.java:365)
      Aug 10 01:15:35 	at org.apache.maven.surefire.junit4.JUnit4Provider.executeWithRerun(JUnit4Provider.java:273)
      Aug 10 01:15:35 	at org.apache.maven.surefire.junit4.JUnit4Provider.executeTestSet(JUnit4Provider.java:238)
      Aug 10 01:15:35 	at org.apache.maven.surefire.junit4.JUnit4Provider.invoke(JUnit4Provider.java:159)
      Aug 10 01:15:35 	at org.apache.maven.surefire.booter.ForkedBooter.invokeProviderInSameClassLoader(ForkedBooter.java:384)
      Aug 10 01:15:35 	at org.apache.maven.surefire.booter.ForkedBooter.runSuitesInProcess(ForkedBooter.java:345)
      Aug 10 01:15:35 	at org.apache.maven.surefire.booter.ForkedBooter.execute(ForkedBooter.java:126)
      Aug 10 01:15:35 	at org.apache.maven.surefire.booter.ForkedBooter.main(ForkedBooter.java:418)

        Attachments

          Activity

            People

            • Assignee:
              Unassigned
              Reporter:
              xtsong Xintong Song
            • Votes:
              0 Vote for this issue
              Watchers:
              6 Start watching this issue

              Dates

              • Created:
                Updated: