Uploaded image for project: 'Flink'
  1. Flink
  2. FLINK-23524

AdaptiveSchedulerClusterITCase fails on Azure

    XMLWordPrintableJSON

    Details

      Description

      https://dev.azure.com/apache-flink/apache-flink/_build/results?buildId=21053&view=logs&j=a57e0635-3fad-5b08-57c7-a4142d7d6fa9&t=2ef0effc-1da1-50e5-c2bd-aab434b1c5b7&l=8177

      Jul 27 22:09:39 [ERROR] Tests run: 2, Failures: 1, Errors: 0, Skipped: 0, Time elapsed: 19.558 s <<< FAILURE! - in org.apache.flink.runtime.scheduler.adaptive.AdaptiveSchedulerClusterITCase
      Jul 27 22:09:39 [ERROR] testAutomaticScaleUp(org.apache.flink.runtime.scheduler.adaptive.AdaptiveSchedulerClusterITCase)  Time elapsed: 14.541 s  <<< FAILURE!
      Jul 27 22:09:39 java.lang.AssertionError: expected:<6> but was:<7>
      Jul 27 22:09:39 	at org.junit.Assert.fail(Assert.java:89)
      Jul 27 22:09:39 	at org.junit.Assert.failNotEquals(Assert.java:835)
      Jul 27 22:09:39 	at org.junit.Assert.assertEquals(Assert.java:647)
      Jul 27 22:09:39 	at org.junit.Assert.assertEquals(Assert.java:633)
      Jul 27 22:09:39 	at org.apache.flink.runtime.scheduler.adaptive.AdaptiveSchedulerClusterITCase.testAutomaticScaleUp(AdaptiveSchedulerClusterITCase.java:121)
      Jul 27 22:09:39 	at sun.reflect.NativeMethodAccessorImpl.invoke0(Native Method)
      Jul 27 22:09:39 	at sun.reflect.NativeMethodAccessorImpl.invoke(NativeMethodAccessorImpl.java:62)
      Jul 27 22:09:39 	at sun.reflect.DelegatingMethodAccessorImpl.invoke(DelegatingMethodAccessorImpl.java:43)
      Jul 27 22:09:39 	at java.lang.reflect.Method.invoke(Method.java:498)
      Jul 27 22:09:39 	at org.junit.runners.model.FrameworkMethod$1.runReflectiveCall(FrameworkMethod.java:59)
      Jul 27 22:09:39 	at org.junit.internal.runners.model.ReflectiveCallable.run(ReflectiveCallable.java:12)
      Jul 27 22:09:39 	at org.junit.runners.model.FrameworkMethod.invokeExplosively(FrameworkMethod.java:56)
      Jul 27 22:09:39 	at org.junit.internal.runners.statements.InvokeMethod.evaluate(InvokeMethod.java:17)
      Jul 27 22:09:39 	at org.junit.rules.ExternalResource$1.evaluate(ExternalResource.java:54)
      Jul 27 22:09:39 	at org.apache.flink.util.TestNameProvider$1.evaluate(TestNameProvider.java:45)
      Jul 27 22:09:39 	at org.junit.rules.TestWatcher$1.evaluate(TestWatcher.java:61)
      Jul 27 22:09:39 	at org.junit.runners.ParentRunner$3.evaluate(ParentRunner.java:306)
      Jul 27 22:09:39 	at org.junit.runners.BlockJUnit4ClassRunner$1.evaluate(BlockJUnit4ClassRunner.java:100)
      Jul 27 22:09:39 	at org.junit.runners.ParentRunner.runLeaf(ParentRunner.java:366)
      Jul 27 22:09:39 	at org.junit.runners.BlockJUnit4ClassRunner.runChild(BlockJUnit4ClassRunner.java:103)
      Jul 27 22:09:39 	at org.junit.runners.BlockJUnit4ClassRunner.runChild(BlockJUnit4ClassRunner.java:63)
      Jul 27 22:09:39 	at org.junit.runners.ParentRunner$4.run(ParentRunner.java:331)
      Jul 27 22:09:39 	at org.junit.runners.ParentRunner$1.schedule(ParentRunner.java:79)
      Jul 27 22:09:39 	at org.junit.runners.ParentRunner.runChildren(ParentRunner.java:329)
      Jul 27 22:09:39 	at org.junit.runners.ParentRunner.access$100(ParentRunner.java:66)
      Jul 27 22:09:39 	at org.junit.runners.ParentRunner$2.evaluate(ParentRunner.java:293)
      Jul 27 22:09:39 	at org.junit.runners.ParentRunner$3.evaluate(ParentRunner.java:306)
      Jul 27 22:09:39 	at org.junit.runners.ParentRunner.run(ParentRunner.java:413)
      Jul 27 22:09:39 	at org.apache.maven.surefire.junit4.JUnit4Provider.execute(JUnit4Provider.java:365)
      Jul 27 22:09:39 	at org.apache.maven.surefire.junit4.JUnit4Provider.executeWithRerun(JUnit4Provider.java:273)
      Jul 27 22:09:39 	at org.apache.maven.surefire.junit4.JUnit4Provider.executeTestSet(JUnit4Provider.java:238)
      Jul 27 22:09:39 	at org.apache.maven.surefire.junit4.JUnit4Provider.invoke(JUnit4Provider.java:159)
      Jul 27 22:09:39 	at org.apache.maven.surefire.booter.ForkedBooter.invokeProviderInSameClassLoader(ForkedBooter.java:384)
      Jul 27 22:09:39 	at org.apache.maven.surefire.booter.ForkedBooter.runSuitesInProcess(ForkedBooter.java:345)
      Jul 27 22:09:39 	at org.apache.maven.surefire.booter.ForkedBooter.execute(ForkedBooter.java:126)
      Jul 27 22:09:39 	at org.apache.maven.surefire.booter.ForkedBooter.main(ForkedBooter.java:418)
      
      

        Attachments

          Issue Links

            Activity

              People

              • Assignee:
                chesnay Chesnay Schepler
                Reporter:
                dwysakowicz Dawid Wysakowicz
              • Votes:
                0 Vote for this issue
                Watchers:
                1 Start watching this issue

                Dates

                • Created:
                  Updated:
                  Resolved: