Uploaded image for project: 'Flink'
  1. Flink
  2. FLINK-23351

FileReadingWatermarkITCase.testWatermarkEmissionWithChaining fails due to "too few watermarks emitted" on azure

    XMLWordPrintableJSON

    Details

      Description

      https://dev.azure.com/apache-flink/apache-flink/_build/results?buildId=20267&view=logs&j=a549b384-c55a-52c0-c451-00e0477ab6db&t=81f2da51-a161-54c7-5b84-6001fed26530&l=10500

      Jul 10 22:53:45 [ERROR] Tests run: 1, Failures: 1, Errors: 0, Skipped: 0, Time elapsed: 21.065 s <<< FAILURE! - in org.apache.flink.test.streaming.api.FileReadingWatermarkITCase
      Jul 10 22:53:45 [ERROR] testWatermarkEmissionWithChaining(org.apache.flink.test.streaming.api.FileReadingWatermarkITCase)  Time elapsed: 20.25 s  <<< FAILURE!
      Jul 10 22:53:45 java.lang.AssertionError: too few watermarks emitted in 3057 ms expected:<305.0> but was:<124.0>
      Jul 10 22:53:45 	at org.junit.Assert.fail(Assert.java:89)
      Jul 10 22:53:45 	at org.junit.Assert.failNotEquals(Assert.java:835)
      Jul 10 22:53:45 	at org.junit.Assert.assertEquals(Assert.java:555)
      Jul 10 22:53:45 	at org.apache.flink.test.streaming.api.FileReadingWatermarkITCase.testWatermarkEmissionWithChaining(FileReadingWatermarkITCase.java:79)
      Jul 10 22:53:45 	at sun.reflect.NativeMethodAccessorImpl.invoke0(Native Method)
      Jul 10 22:53:45 	at sun.reflect.NativeMethodAccessorImpl.invoke(NativeMethodAccessorImpl.java:62)
      Jul 10 22:53:45 	at sun.reflect.DelegatingMethodAccessorImpl.invoke(DelegatingMethodAccessorImpl.java:43)
      Jul 10 22:53:45 	at java.lang.reflect.Method.invoke(Method.java:498)
      Jul 10 22:53:45 	at org.junit.runners.model.FrameworkMethod$1.runReflectiveCall(FrameworkMethod.java:59)
      Jul 10 22:53:45 	at org.junit.internal.runners.model.ReflectiveCallable.run(ReflectiveCallable.java:12)
      Jul 10 22:53:45 	at org.junit.runners.model.FrameworkMethod.invokeExplosively(FrameworkMethod.java:56)
      Jul 10 22:53:45 	at org.junit.internal.runners.statements.InvokeMethod.evaluate(InvokeMethod.java:17)
      Jul 10 22:53:45 	at org.junit.rules.ExternalResource$1.evaluate(ExternalResource.java:54)
      Jul 10 22:53:45 	at org.junit.runners.ParentRunner$3.evaluate(ParentRunner.java:306)
      Jul 10 22:53:45 	at org.junit.runners.BlockJUnit4ClassRunner$1.evaluate(BlockJUnit4ClassRunner.java:100)
      Jul 10 22:53:45 	at org.junit.runners.ParentRunner.runLeaf(ParentRunner.java:366)
      Jul 10 22:53:45 	at org.junit.runners.BlockJUnit4ClassRunner.runChild(BlockJUnit4ClassRunner.java:103)
      Jul 10 22:53:45 	at org.junit.runners.BlockJUnit4ClassRunner.runChild(BlockJUnit4ClassRunner.java:63)
      Jul 10 22:53:45 	at org.junit.runners.ParentRunner$4.run(ParentRunner.java:331)
      Jul 10 22:53:45 	at org.junit.runners.ParentRunner$1.schedule(ParentRunner.java:79)
      Jul 10 22:53:45 	at org.junit.runners.ParentRunner.runChildren(ParentRunner.java:329)
      Jul 10 22:53:45 	at org.junit.runners.ParentRunner.access$100(ParentRunner.java:66)
      Jul 10 22:53:45 	at org.junit.runners.ParentRunner$2.evaluate(ParentRunner.java:293)
      Jul 10 22:53:45 	at org.junit.runners.ParentRunner$3.evaluate(ParentRunner.java:306)
      Jul 10 22:53:45 	at org.junit.runners.ParentRunner.run(ParentRunner.java:413)
      Jul 10 22:53:45 	at org.apache.maven.surefire.junit4.JUnit4Provider.execute(JUnit4Provider.java:365)
      Jul 10 22:53:45 	at org.apache.maven.surefire.junit4.JUnit4Provider.executeWithRerun(JUnit4Provider.java:273)
      Jul 10 22:53:45 	at org.apache.maven.surefire.junit4.JUnit4Provider.executeTestSet(JUnit4Provider.java:238)
      Jul 10 22:53:45 	at org.apache.maven.surefire.junit4.JUnit4Provider.invoke(JUnit4Provider.java:159)
      Jul 10 22:53:45 	at org.apache.maven.surefire.booter.ForkedBooter.invokeProviderInSameClassLoader(ForkedBooter.java:384)
      Jul 10 22:53:45 	at org.apache.maven.surefire.booter.ForkedBooter.runSuitesInProcess(ForkedBooter.java:345)
      Jul 10 22:53:45 	at org.apache.maven.surefire.booter.ForkedBooter.execute(ForkedBooter.java:126)
      Jul 10 22:53:45 	at org.apache.maven.surefire.booter.ForkedBooter.main(ForkedBooter.java:418)
      

        Attachments

          Activity

            People

            • Assignee:
              fabian.paul Fabian Paul
              Reporter:
              xtsong Xintong Song
            • Votes:
              0 Vote for this issue
              Watchers:
              4 Start watching this issue

              Dates

              • Created:
                Updated:
                Resolved: