Uploaded image for project: 'Flink'
  1. Flink
  2. FLINK-23322

RMQSourceITCase.testStopWithSavepoint fails on azure due to timeout

Attach filesAttach ScreenshotVotersWatch issueWatchersCreate sub-taskLinkCloneUpdate Comment AuthorReplace String in CommentUpdate Comment VisibilityDelete Comments
    XMLWordPrintableJSON

    Details

      Description

      https://dev.azure.com/apache-flink/apache-flink/_build/results?buildId=20196&view=logs&j=d44f43ce-542c-597d-bf94-b0718c71e5e8&t=03dca39c-73e8-5aaf-601d-328ae5c35f20&l=13696

      [ERROR] Tests run: 1, Failures: 0, Errors: 1, Skipped: 0, Time elapsed: 41.237 s <<< FAILURE! - in org.apache.flink.streaming.connectors.rabbitmq.RMQSourceITCase
      [ERROR] testStopWithSavepoint(org.apache.flink.streaming.connectors.rabbitmq.RMQSourceITCase)  Time elapsed: 7.609 s  <<< ERROR!
      java.util.concurrent.TimeoutException
      	at com.rabbitmq.utility.BlockingCell.get(BlockingCell.java:77)
      	at com.rabbitmq.utility.BlockingCell.uninterruptibleGet(BlockingCell.java:120)
      	at com.rabbitmq.utility.BlockingValueOrException.uninterruptibleGetValue(BlockingValueOrException.java:36)
      	at com.rabbitmq.client.impl.AMQChannel$BlockingRpcContinuation.getReply(AMQChannel.java:502)
      	at com.rabbitmq.client.impl.AMQConnection.start(AMQConnection.java:326)
      	at com.rabbitmq.client.impl.recovery.RecoveryAwareAMQConnectionFactory.newConnection(RecoveryAwareAMQConnectionFactory.java:64)
      	at com.rabbitmq.client.impl.recovery.AutorecoveringConnection.init(AutorecoveringConnection.java:156)
      	at com.rabbitmq.client.ConnectionFactory.newConnection(ConnectionFactory.java:1130)
      	at com.rabbitmq.client.ConnectionFactory.newConnection(ConnectionFactory.java:1087)
      	at com.rabbitmq.client.ConnectionFactory.newConnection(ConnectionFactory.java:1045)
      	at com.rabbitmq.client.ConnectionFactory.newConnection(ConnectionFactory.java:1207)
      	at org.apache.flink.streaming.connectors.rabbitmq.RMQSourceITCase.getRMQConnection(RMQSourceITCase.java:133)
      	at org.apache.flink.streaming.connectors.rabbitmq.RMQSourceITCase.setUp(RMQSourceITCase.java:82)
      	at sun.reflect.NativeMethodAccessorImpl.invoke0(Native Method)
      	at sun.reflect.NativeMethodAccessorImpl.invoke(NativeMethodAccessorImpl.java:62)
      	at sun.reflect.DelegatingMethodAccessorImpl.invoke(DelegatingMethodAccessorImpl.java:43)
      	at java.lang.reflect.Method.invoke(Method.java:498)
      	at org.junit.runners.model.FrameworkMethod$1.runReflectiveCall(FrameworkMethod.java:50)
      	at org.junit.internal.runners.model.ReflectiveCallable.run(ReflectiveCallable.java:12)
      	at org.junit.runners.model.FrameworkMethod.invokeExplosively(FrameworkMethod.java:47)
      	at org.junit.internal.runners.statements.RunBefores.evaluate(RunBefores.java:24)
      	at org.junit.rules.ExternalResource$1.evaluate(ExternalResource.java:48)
      	at org.junit.rules.ExternalResource$1.evaluate(ExternalResource.java:48)
      	at org.junit.rules.RunRules.evaluate(RunRules.java:20)
      	at org.junit.runners.ParentRunner.runLeaf(ParentRunner.java:325)
      	at org.junit.runners.BlockJUnit4ClassRunner.runChild(BlockJUnit4ClassRunner.java:78)
      	at org.junit.runners.BlockJUnit4ClassRunner.runChild(BlockJUnit4ClassRunner.java:57)
      	at org.junit.runners.ParentRunner$3.run(ParentRunner.java:290)
      	at org.junit.runners.ParentRunner$1.schedule(ParentRunner.java:71)
      	at org.junit.runners.ParentRunner.runChildren(ParentRunner.java:288)
      	at org.junit.runners.ParentRunner.access$000(ParentRunner.java:58)
      	at org.junit.runners.ParentRunner$2.evaluate(ParentRunner.java:268)
      	at org.testcontainers.containers.FailureDetectingExternalResource$1.evaluate(FailureDetectingExternalResource.java:30)
      at org.junit.rules.RunRules.evaluate(RunRules.java:20)
      	at org.junit.runners.ParentRunner.run(ParentRunner.java:363)
      	at org.apache.maven.surefire.junit4.JUnit4Provider.execute(JUnit4Provider.java:365)
      	at org.apache.maven.surefire.junit4.JUnit4Provider.executeWithRerun(JUnit4Provider.java:273)
      	at org.apache.maven.surefire.junit4.JUnit4Provider.executeTestSet(JUnit4Provider.java:238)
      	at org.apache.maven.surefire.junit4.JUnit4Provider.invoke(JUnit4Provider.java:159)
      	at org.apache.maven.surefire.booter.ForkedBooter.invokeProviderInSameClassLoader(ForkedBooter.java:384)
      	at org.apache.maven.surefire.booter.ForkedBooter.runSuitesInProcess(ForkedBooter.java:345)
      	at org.apache.maven.surefire.booter.ForkedBooter.execute(ForkedBooter.java:126)
      	at org.apache.maven.surefire.booter.ForkedBooter.main(ForkedBooter.java:418)
      

        Attachments

          Activity

            People

            • Assignee:
              fabian.paul Fabian Paul
              Reporter:
              xtsong Xintong Song

              Dates

              • Created:
                Updated:
                Resolved:

                Issue deployment