Uploaded image for project: 'Flink'
  1. Flink
  2. FLINK-23262

FileReadingWatermarkITCase.testWatermarkEmissionWithChaining fails on azure

    XMLWordPrintableJSON

    Details

      Description

      https://dev.azure.com/apache-flink/apache-flink/_build/results?buildId=19942&view=logs&j=219e462f-e75e-506c-3671-5017d866ccf6&t=4c5dc768-5c82-5ab0-660d-086cb90b76a0&l=5584

      Jul 05 22:19:00 [ERROR] Tests run: 1, Failures: 1, Errors: 0, Skipped: 0, Time elapsed: 4.334 s <<< FAILURE! - in org.apache.flink.test.streaming.api.FileReadingWatermarkITCase
      Jul 05 22:19:00 [ERROR] testWatermarkEmissionWithChaining(org.apache.flink.test.streaming.api.FileReadingWatermarkITCase)  Time elapsed: 4.16 s  <<< FAILURE!
      Jul 05 22:19:00 java.lang.AssertionError: too few watermarks emitted: 4
      Jul 05 22:19:00 	at org.junit.Assert.fail(Assert.java:89)
      Jul 05 22:19:00 	at org.junit.Assert.assertTrue(Assert.java:42)
      Jul 05 22:19:00 	at org.apache.flink.test.streaming.api.FileReadingWatermarkITCase.testWatermarkEmissionWithChaining(FileReadingWatermarkITCase.java:65)
      Jul 05 22:19:00 	at sun.reflect.NativeMethodAccessorImpl.invoke0(Native Method)
      Jul 05 22:19:00 	at sun.reflect.NativeMethodAccessorImpl.invoke(NativeMethodAccessorImpl.java:62)
      Jul 05 22:19:00 	at sun.reflect.DelegatingMethodAccessorImpl.invoke(DelegatingMethodAccessorImpl.java:43)
      Jul 05 22:19:00 	at java.lang.reflect.Method.invoke(Method.java:498)
      Jul 05 22:19:00 	at org.junit.runners.model.FrameworkMethod$1.runReflectiveCall(FrameworkMethod.java:59)
      Jul 05 22:19:00 	at org.junit.internal.runners.model.ReflectiveCallable.run(ReflectiveCallable.java:12)
      Jul 05 22:19:00 	at org.junit.runners.model.FrameworkMethod.invokeExplosively(FrameworkMethod.java:56)
      Jul 05 22:19:00 	at org.junit.internal.runners.statements.InvokeMethod.evaluate(InvokeMethod.java:17)
      Jul 05 22:19:00 	at org.junit.runners.ParentRunner$3.evaluate(ParentRunner.java:306)
      Jul 05 22:19:00 	at org.junit.runners.BlockJUnit4ClassRunner$1.evaluate(BlockJUnit4ClassRunner.java:100)
      Jul 05 22:19:00 	at org.junit.runners.ParentRunner.runLeaf(ParentRunner.java:366)
      Jul 05 22:19:00 	at org.junit.runners.BlockJUnit4ClassRunner.runChild(BlockJUnit4ClassRunner.java:103)
      Jul 05 22:19:00 	at org.junit.runners.BlockJUnit4ClassRunner.runChild(BlockJUnit4ClassRunner.java:63)
      Jul 05 22:19:00 	at org.junit.runners.ParentRunner$4.run(ParentRunner.java:331)
      Jul 05 22:19:00 	at org.junit.runners.ParentRunner$1.schedule(ParentRunner.java:79)
      Jul 05 22:19:00 	at org.junit.runners.ParentRunner.runChildren(ParentRunner.java:329)
      Jul 05 22:19:00 	at org.junit.runners.ParentRunner.access$100(ParentRunner.java:66)
      Jul 05 22:19:00 	at org.junit.runners.ParentRunner$2.evaluate(ParentRunner.java:293)
      Jul 05 22:19:00 	at org.junit.runners.ParentRunner$3.evaluate(ParentRunner.java:306)
      Jul 05 22:19:00 	at org.junit.runners.ParentRunner.run(ParentRunner.java:413)
      Jul 05 22:19:00 	at org.apache.maven.surefire.junit4.JUnit4Provider.execute(JUnit4Provider.java:365)
      Jul 05 22:19:00 	at org.apache.maven.surefire.junit4.JUnit4Provider.executeWithRerun(JUnit4Provider.java:273)
      Jul 05 22:19:00 	at org.apache.maven.surefire.junit4.JUnit4Provider.executeTestSet(JUnit4Provider.java:238)
      Jul 05 22:19:00 	at org.apache.maven.surefire.junit4.JUnit4Provider.invoke(JUnit4Provider.java:159)
      Jul 05 22:19:00 	at org.apache.maven.surefire.booter.ForkedBooter.invokeProviderInSameClassLoader(ForkedBooter.java:384)
      Jul 05 22:19:00 	at org.apache.maven.surefire.booter.ForkedBooter.runSuitesInProcess(ForkedBooter.java:345)
      Jul 05 22:19:00 	at org.apache.maven.surefire.booter.ForkedBooter.execute(ForkedBooter.java:126)
      Jul 05 22:19:00 	at org.apache.maven.surefire.booter.ForkedBooter.main(ForkedBooter.java:418)
      

        Attachments

          Issue Links

            Activity

              People

              • Assignee:
                roman Roman Khachatryan
                Reporter:
                xtsong Xintong Song
              • Votes:
                0 Vote for this issue
                Watchers:
                4 Start watching this issue

                Dates

                • Created:
                  Updated:
                  Resolved: