Uploaded image for project: 'Flink'
  1. Flink
  2. FLINK-23238

EventTimeWindowCheckpointingITCase.testTumblingTimeWindowWithKVStateMaxMaxParallelism fails on azure

    XMLWordPrintableJSON

    Details

    • Type: Bug
    • Status: Open
    • Priority: Major
    • Resolution: Unresolved
    • Affects Version/s: 1.12.4
    • Fix Version/s: None
    • Component/s: API / DataStream
    • Labels:

      Description

      https://dev.azure.com/apache-flink/apache-flink/_build/results?buildId=19873&view=logs&j=baf26b34-3c6a-54e8-f93f-cf269b32f802&t=6dff16b1-bf54-58f3-23c6-76282f49a185&l=4490

      [ERROR] Tests run: 42, Failures: 1, Errors: 0, Skipped: 0, Time elapsed: 261.311 s <<< FAILURE! - in org.apache.flink.test.checkpointing.EventTimeWindowCheckpointingITCase
      [ERROR] testTumblingTimeWindowWithKVStateMaxMaxParallelism[statebackend type =ROCKSDB_INCREMENTAL](org.apache.flink.test.checkpointing.EventTimeWindowCheckpointingITCase)  Time elapsed: 79.062 s  <<< FAILURE!
      java.lang.AssertionError: Job execution failed.
      	at org.junit.Assert.fail(Assert.java:88)
      	at org.apache.flink.test.checkpointing.EventTimeWindowCheckpointingITCase.doTestTumblingTimeWindowWithKVState(EventTimeWindowCheckpointingITCase.java:434)
      	at org.apache.flink.test.checkpointing.EventTimeWindowCheckpointingITCase.testTumblingTimeWindowWithKVStateMaxMaxParallelism(EventTimeWindowCheckpointingITCase.java:350)
      	at sun.reflect.NativeMethodAccessorImpl.invoke0(Native Method)
      	at sun.reflect.NativeMethodAccessorImpl.invoke(NativeMethodAccessorImpl.java:62)
      	at sun.reflect.DelegatingMethodAccessorImpl.invoke(DelegatingMethodAccessorImpl.java:43)
      	at java.lang.reflect.Method.invoke(Method.java:498)
      	at org.junit.runners.model.FrameworkMethod$1.runReflectiveCall(FrameworkMethod.java:50)
      	at org.junit.internal.runners.model.ReflectiveCallable.run(ReflectiveCallable.java:12)
      	at org.junit.runners.model.FrameworkMethod.invokeExplosively(FrameworkMethod.java:47)
      	at org.junit.internal.runners.statements.InvokeMethod.evaluate(InvokeMethod.java:17)
      	at org.junit.internal.runners.statements.RunBefores.evaluate(RunBefores.java:26)
      	at org.junit.internal.runners.statements.RunAfters.evaluate(RunAfters.java:27)
      	at org.junit.rules.TestWatcher$1.evaluate(TestWatcher.java:55)
      	at org.junit.rules.TestWatcher$1.evaluate(TestWatcher.java:55)
      	at org.junit.rules.RunRules.evaluate(RunRules.java:20)
      	at org.junit.runners.ParentRunner.runLeaf(ParentRunner.java:325)
      	at org.junit.runners.BlockJUnit4ClassRunner.runChild(BlockJUnit4ClassRunner.java:78)
      	at org.junit.runners.BlockJUnit4ClassRunner.runChild(BlockJUnit4ClassRunner.java:57)
      	at org.junit.runners.ParentRunner$3.run(ParentRunner.java:290)
      	at org.junit.runners.ParentRunner$1.schedule(ParentRunner.java:71)
      	at org.junit.runners.ParentRunner.runChildren(ParentRunner.java:288)
      	at org.junit.runners.ParentRunner.access$000(ParentRunner.java:58)
      	at org.junit.runners.ParentRunner$2.evaluate(ParentRunner.java:268)
      	at org.junit.runners.ParentRunner.run(ParentRunner.java:363)
      	at org.junit.runners.Suite.runChild(Suite.java:128)
      	at org.junit.runners.Suite.runChild(Suite.java:27)
      	at org.junit.runners.ParentRunner$3.run(ParentRunner.java:290)
      	at org.junit.runners.ParentRunner$1.schedule(ParentRunner.java:71)
      	at org.junit.runners.ParentRunner.runChildren(ParentRunner.java:288)
      	at org.junit.runners.ParentRunner.access$000(ParentRunner.java:58)
      	at org.junit.runners.ParentRunner$2.evaluate(ParentRunner.java:268)
      	at org.junit.rules.ExternalResource$1.evaluate(ExternalResource.java:48)
      	at org.junit.rules.RunRules.evaluate(RunRules.java:20)
      	at org.junit.runners.ParentRunner.run(ParentRunner.java:363)
      	at org.apache.maven.surefire.junit4.JUnit4Provider.execute(JUnit4Provider.java:365)
      	at org.apache.maven.surefire.junit4.JUnit4Provider.executeWithRerun(JUnit4Provider.java:273)
      	at org.apache.maven.surefire.junit4.JUnit4Provider.executeTestSet(JUnit4Provider.java:238)
      	at org.apache.maven.surefire.junit4.JUnit4Provider.invoke(JUnit4Provider.java:159)
      	at org.apache.maven.surefire.booter.ForkedBooter.invokeProviderInSameClassLoader(ForkedBooter.java:384)
      	at org.apache.maven.surefire.booter.ForkedBooter.runSuitesInProcess(ForkedBooter.java:345)
      	at org.apache.maven.surefire.booter.ForkedBooter.execute(ForkedBooter.java:126)
      	at org.apache.maven.surefire.booter.ForkedBooter.main(ForkedBooter.java:418)
      

        Attachments

          Activity

            People

            • Assignee:
              Unassigned
              Reporter:
              xtsong Xintong Song
            • Votes:
              0 Vote for this issue
              Watchers:
              2 Start watching this issue

              Dates

              • Created:
                Updated: