Uploaded image for project: 'Flink'
  1. Flink
  2. FLINK-22457

KafkaSourceLegacyITCase.testMultipleSourcesOnePartition fails because of timeout

    XMLWordPrintableJSON

Details

    Description

      https://dev.azure.com/apache-flink/apache-flink/_build/results?buildId=17140&view=logs&j=1fc6e7bf-633c-5081-c32a-9dea24b05730&t=80a658d1-f7f6-5d93-2758-53ac19fd5b19&l=7045

      Apr 24 23:47:33 [ERROR] Tests run: 21, Failures: 0, Errors: 1, Skipped: 0, Time elapsed: 174.335 s <<< FAILURE! - in org.apache.flink.connector.kafka.source.KafkaSourceLegacyITCase
      Apr 24 23:47:33 [ERROR] testMultipleSourcesOnePartition(org.apache.flink.connector.kafka.source.KafkaSourceLegacyITCase)  Time elapsed: 60.019 s  <<< ERROR!
      Apr 24 23:47:33 org.junit.runners.model.TestTimedOutException: test timed out after 60000 milliseconds
      Apr 24 23:47:33 	at sun.misc.Unsafe.park(Native Method)
      Apr 24 23:47:33 	at java.util.concurrent.locks.LockSupport.park(LockSupport.java:175)
      Apr 24 23:47:33 	at java.util.concurrent.CompletableFuture$Signaller.block(CompletableFuture.java:1707)
      Apr 24 23:47:33 	at java.util.concurrent.ForkJoinPool.managedBlock(ForkJoinPool.java:3323)
      Apr 24 23:47:33 	at java.util.concurrent.CompletableFuture.waitingGet(CompletableFuture.java:1742)
      Apr 24 23:47:33 	at java.util.concurrent.CompletableFuture.get(CompletableFuture.java:1908)
      Apr 24 23:47:33 	at org.apache.flink.test.util.TestUtils.tryExecute(TestUtils.java:49)
      Apr 24 23:47:33 	at org.apache.flink.streaming.connectors.kafka.KafkaConsumerTestBase.runMultipleSourcesOnePartitionExactlyOnceTest(KafkaConsumerTestBase.java:1112)
      Apr 24 23:47:33 	at org.apache.flink.connector.kafka.source.KafkaSourceLegacyITCase.testMultipleSourcesOnePartition(KafkaSourceLegacyITCase.java:87)
      Apr 24 23:47:33 	at sun.reflect.NativeMethodAccessorImpl.invoke0(Native Method)
      Apr 24 23:47:33 	at sun.reflect.NativeMethodAccessorImpl.invoke(NativeMethodAccessorImpl.java:62)
      Apr 24 23:47:33 	at sun.reflect.DelegatingMethodAccessorImpl.invoke(DelegatingMethodAccessorImpl.java:43)
      Apr 24 23:47:33 	at java.lang.reflect.Method.invoke(Method.java:498)
      Apr 24 23:47:33 	at org.junit.runners.model.FrameworkMethod$1.runReflectiveCall(FrameworkMethod.java:50)
      Apr 24 23:47:33 	at org.junit.internal.runners.model.ReflectiveCallable.run(ReflectiveCallable.java:12)
      Apr 24 23:47:33 	at org.junit.runners.model.FrameworkMethod.invokeExplosively(FrameworkMethod.java:47)
      Apr 24 23:47:33 	at org.junit.internal.runners.statements.InvokeMethod.evaluate(InvokeMethod.java:17)
      Apr 24 23:47:33 	at org.junit.internal.runners.statements.FailOnTimeout$CallableStatement.call(FailOnTimeout.java:298)
      Apr 24 23:47:33 	at org.junit.internal.runners.statements.FailOnTimeout$CallableStatement.call(FailOnTimeout.java:292)
      Apr 24 23:47:33 	at java.util.concurrent.FutureTask.run(FutureTask.java:266)
      Apr 24 23:47:33 	at java.lang.Thread.run(Thread.java:748)
      
      

      Attachments

        Issue Links

          Activity

            People

              fpaul Fabian Paul
              maguowei Guowei Ma
              Votes:
              0 Vote for this issue
              Watchers:
              4 Start watching this issue

              Dates

                Created:
                Updated: