Uploaded image for project: 'Flink'
  1. Flink
  2. FLINK-22068

FlinkKinesisConsumerTest.testPeriodicWatermark fails on azure

    XMLWordPrintableJSON

    Details

      Description

      [ERROR] Tests run: 11, Failures: 1, Errors: 0, Skipped: 0, Time elapsed: 5.567 s <<< FAILURE! - in org.apache.flink.streaming.connectors.kinesis.FlinkKinesisConsumerTest
      [ERROR] testPeriodicWatermark(org.apache.flink.streaming.connectors.kinesis.FlinkKinesisConsumerTest)  Time elapsed: 0.845 s  <<< FAILURE!
      java.lang.AssertionError: 
      
      Expected: iterable containing [<Watermark @ -3>, <Watermark @ 5>]
           but: item 0: was <Watermark @ 5>
      	at org.hamcrest.MatcherAssert.assertThat(MatcherAssert.java:20)
      	at org.junit.Assert.assertThat(Assert.java:956)
      	at org.junit.Assert.assertThat(Assert.java:923)
      	at org.apache.flink.streaming.connectors.kinesis.FlinkKinesisConsumerTest.testPeriodicWatermark(FlinkKinesisConsumerTest.java:988)
      	at sun.reflect.NativeMethodAccessorImpl.invoke0(Native Method)
      	at sun.reflect.NativeMethodAccessorImpl.invoke(NativeMethodAccessorImpl.java:62)
      	at sun.reflect.DelegatingMethodAccessorImpl.invoke(DelegatingMethodAccessorImpl.java:43)
      	at java.lang.reflect.Method.invoke(Method.java:498)
      	at org.junit.internal.runners.TestMethod.invoke(TestMethod.java:68)
      	at org.powermock.modules.junit4.internal.impl.PowerMockJUnit44RunnerDelegateImpl$PowerMockJUnit44MethodRunner.runTestMethod(PowerMockJUnit44RunnerDelegateImpl.java:326)
      	at org.junit.internal.runners.MethodRoadie$2.run(MethodRoadie.java:89)
      	at org.junit.internal.runners.MethodRoadie.runBeforesThenTestThenAfters(MethodRoadie.java:97)
      	at org.powermock.modules.junit4.internal.impl.PowerMockJUnit44RunnerDelegateImpl$PowerMockJUnit44MethodRunner.executeTest(PowerMockJUnit44RunnerDelegateImpl.java:310)
      	at org.powermock.modules.junit4.internal.impl.PowerMockJUnit47RunnerDelegateImpl$PowerMockJUnit47MethodRunner.executeTestInSuper(PowerMockJUnit47RunnerDelegateImpl.java:131)
      	at org.powermock.modules.junit4.internal.impl.PowerMockJUnit47RunnerDelegateImpl$PowerMockJUnit47MethodRunner.access$100(PowerMockJUnit47RunnerDelegateImpl.java:59)
      	at org.powermock.modules.junit4.internal.impl.PowerMockJUnit47RunnerDelegateImpl$PowerMockJUnit47MethodRunner$TestExecutorStatement.evaluate(PowerMockJUnit47RunnerDelegateImpl.java:147)
      	at org.junit.rules.TestWatcher$1.evaluate(TestWatcher.java:55)
      	at org.apache.flink.util.TestNameProvider$1.evaluate(TestNameProvider.java:45)
      	at org.powermock.modules.junit4.internal.impl.PowerMockJUnit47RunnerDelegateImpl$PowerMockJUnit47MethodRunner.evaluateStatement(PowerMockJUnit47RunnerDelegateImpl.java:107)
      	at org.powermock.modules.junit4.internal.impl.PowerMockJUnit47RunnerDelegateImpl$PowerMockJUnit47MethodRunner.executeTest(PowerMockJUnit47RunnerDelegateImpl.java:82)
      	at org.powermock.modules.junit4.internal.impl.PowerMockJUnit44RunnerDelegateImpl$PowerMockJUnit44MethodRunner.runBeforesThenTestThenAfters(PowerMockJUnit44RunnerDelegateImpl.java:298)
      	at org.junit.internal.runners.MethodRoadie.runTest(MethodRoadie.java:87)
      	at org.junit.internal.runners.MethodRoadie.run(MethodRoadie.java:50)
      	at org.powermock.modules.junit4.internal.impl.PowerMockJUnit44RunnerDelegateImpl.invokeTestMethod(PowerMockJUnit44RunnerDelegateImpl.java:218)
      	at org.powermock.modules.junit4.internal.impl.PowerMockJUnit44RunnerDelegateImpl.runMethods(PowerMockJUnit44RunnerDelegateImpl.java:160)
      	at org.powermock.modules.junit4.internal.impl.PowerMockJUnit44RunnerDelegateImpl$1.run(PowerMockJUnit44RunnerDelegateImpl.java:134)
      	at org.junit.internal.runners.ClassRoadie.runUnprotected(ClassRoadie.java:34)
      	at org.junit.internal.runners.ClassRoadie.runProtected(ClassRoadie.java:44)
      	at org.powermock.modules.junit4.internal.impl.PowerMockJUnit44RunnerDelegateImpl.run(PowerMockJUnit44RunnerDelegateImpl.java:136)
      	at org.powermock.modules.junit4.common.internal.impl.JUnit4TestSuiteChunkerImpl.run(JUnit4TestSuiteChunkerImpl.java:117)
      	at org.powermock.modules.junit4.common.internal.impl.AbstractCommonPowerMockRunner.run(AbstractCommonPowerMockRunner.java:57)
      	at org.powermock.modules.junit4.PowerMockRunner.run(PowerMockRunner.java:59)
      	at org.apache.maven.surefire.junit4.JUnit4Provider.execute(JUnit4Provider.java:365)
      	at org.apache.maven.surefire.junit4.JUnit4Provider.executeWithRerun(JUnit4Provider.java:273)
      	at org.apache.maven.surefire.junit4.JUnit4Provider.executeTestSet(JUnit4Provider.java:238)
      	at org.apache.maven.surefire.junit4.JUnit4Provider.invoke(JUnit4Provider.java:159)
      	at org.apache.maven.surefire.booter.ForkedBooter.invokeProviderInSameClassLoader(ForkedBooter.java:384)
      	at org.apache.maven.surefire.booter.ForkedBooter.runSuitesInProcess(ForkedBooter.java:345)
      	at org.apache.maven.surefire.booter.ForkedBooter.execute(ForkedBooter.java:126)
      	at org.apache.maven.surefire.booter.ForkedBooter.main(ForkedBooter.java:418)
      

      https://dev.azure.com/apache-flink/apache-flink/_build/results?buildId=15864&view=logs&j=d44f43ce-542c-597d-bf94-b0718c71e5e8&t=03dca39c-73e8-5aaf-601d-328ae5c35f20&l=13983

        Attachments

          Issue Links

            Activity

              People

              • Assignee:
                Unassigned
                Reporter:
                dwysakowicz Dawid Wysakowicz
              • Votes:
                0 Vote for this issue
                Watchers:
                2 Start watching this issue

                Dates

                • Created:
                  Updated: