XMLWordPrintableJSON

Details

    • Sub-task
    • Status: Closed
    • Major
    • Resolution: Fixed
    • 1.13.0
    • None
    • Connectors / Kafka, Tests
    • None

    Description

      https://myasuka.visualstudio.com/flink/_build/results?buildId=252&view=logs&j=9401bf33-03c4-5a24-83fe-e51d75db73ef&t=72901ab2-7cd0-57be-82b1-bca51de20fba

      
      [ERROR] Tests run: 1, Failures: 0, Errors: 1, Skipped: 0, Time elapsed: 498.992 s <<< FAILURE! - in org.apache.flink.tests.util.kafka.SQLClientKafkaITCase
      [ERROR] testKafka[0: kafka-version:2.4.1 kafka-sql-version:universal](org.apache.flink.tests.util.kafka.SQLClientKafkaITCase)  Time elapsed: 448.465 s  <<< ERROR!
      java.io.IOException: 
      Process execution failed due error. Error output:
      gzip: stdin: unexpected end of file
      tar: Unexpected EOF in archive
      tar: Unexpected EOF in archive
      tar: Error is not recoverable: exiting now
      
      	at org.apache.flink.tests.util.AutoClosableProcess$AutoClosableProcessBuilder.runBlocking(AutoClosableProcess.java:133)
      	at org.apache.flink.tests.util.AutoClosableProcess$AutoClosableProcessBuilder.runBlocking(AutoClosableProcess.java:108)
      	at org.apache.flink.tests.util.AutoClosableProcess.runBlocking(AutoClosableProcess.java:70)
      	at org.apache.flink.tests.util.kafka.LocalStandaloneKafkaResource.setupKafkaDist(LocalStandaloneKafkaResource.java:112)
      	at org.apache.flink.tests.util.kafka.LocalStandaloneKafkaResource.before(LocalStandaloneKafkaResource.java:102)
      	at org.apache.flink.util.ExternalResource$1.evaluate(ExternalResource.java:46)
      	at org.junit.rules.ExternalResource$1.evaluate(ExternalResource.java:48)
      	at org.apache.flink.util.TestNameProvider$1.evaluate(TestNameProvider.java:45)
      	at org.junit.rules.TestWatcher$1.evaluate(TestWatcher.java:55)
      	at org.junit.rules.RunRules.evaluate(RunRules.java:20)
      	at org.junit.runners.ParentRunner.runLeaf(ParentRunner.java:325)
      	at org.junit.runners.BlockJUnit4ClassRunner.runChild(BlockJUnit4ClassRunner.java:78)
      	at org.junit.runners.BlockJUnit4ClassRunner.runChild(BlockJUnit4ClassRunner.java:57)
      	at org.junit.runners.ParentRunner$3.run(ParentRunner.java:290)
      	at org.junit.runners.ParentRunner$1.schedule(ParentRunner.java:71)
      	at org.junit.runners.ParentRunner.runChildren(ParentRunner.java:288)
      	at org.junit.runners.ParentRunner.access$000(ParentRunner.java:58)
      	at org.junit.runners.ParentRunner$2.evaluate(ParentRunner.java:268)
      	at org.junit.runners.ParentRunner.run(ParentRunner.java:363)
      	at org.junit.runners.Suite.runChild(Suite.java:128)
      	at org.junit.runners.Suite.runChild(Suite.java:27)
      	at org.junit.runners.ParentRunner$3.run(ParentRunner.java:290)
      	at org.junit.runners.ParentRunner$1.schedule(ParentRunner.java:71)
      	at org.junit.runners.ParentRunner.runChildren(ParentRunner.java:288)
      	at org.junit.runners.ParentRunner.access$000(ParentRunner.java:58)
      	at org.junit.runners.ParentRunner$2.evaluate(ParentRunner.java:268)
      	at org.apache.flink.util.ExternalResource$1.evaluate(ExternalResource.java:48)
      	at org.junit.rules.RunRules.evaluate(RunRules.java:20)
      	at org.junit.runners.ParentRunner.run(ParentRunner.java:363)
      	at org.junit.runners.Suite.runChild(Suite.java:128)
      	at org.junit.runners.Suite.runChild(Suite.java:27)
      	at org.junit.runners.ParentRunner$3.run(ParentRunner.java:290)
      	at org.junit.runners.ParentRunner$1.schedule(ParentRunner.java:71)
      	at org.junit.runners.ParentRunner.runChildren(ParentRunner.java:288)
      	at org.junit.runners.ParentRunner.access$000(ParentRunner.java:58)
      	at org.junit.runners.ParentRunner$2.evaluate(ParentRunner.java:268)
      	at org.junit.runners.ParentRunner.run(ParentRunner.java:363)
      	at org.apache.maven.surefire.junitcore.JUnitCore.run(JUnitCore.java:55)
      	at org.apache.maven.surefire.junitcore.JUnitCoreWrapper.createRequestAndRun(JUnitCoreWrapper.java:137)
      	at org.apache.maven.surefire.junitcore.JUnitCoreWrapper.executeEager(JUnitCoreWrapper.java:107)
      	at org.apache.maven.surefire.junitcore.JUnitCoreWrapper.execute(JUnitCoreWrapper.java:83)
      	at org.apache.maven.surefire.junitcore.JUnitCoreWrapper.execute(JUnitCoreWrapper.java:75)
      	at org.apache.maven.surefire.junitcore.JUnitCoreProvider.invoke(JUnitCoreProvider.java:158)
      	at org.apache.maven.surefire.booter.ForkedBooter.invokeProviderInSameClassLoader(ForkedBooter.java:384)
      	at org.apache.maven.surefire.booter.ForkedBooter.runSuitesInProcess(ForkedBooter.java:345)
      	at org.apache.maven.surefire.booter.ForkedBooter.execute(ForkedBooter.java:126)
      	at org.apache.maven.surefire.booter.ForkedBooter.main(ForkedBooter.java:418)
      
      [WARNING] Tests run: 1, Failures: 0, Errors: 0, Skipped: 1, Time elapsed: 0 s - in org.apache.flink.tests.util.kafka.StreamingKafkaITCase
      
      
      

      Attachments

        Activity

          People

            chesnay Chesnay Schepler
            yunta Yun Tang
            Votes:
            0 Vote for this issue
            Watchers:
            6 Start watching this issue

            Dates

              Created:
              Updated:
              Resolved: