Uploaded image for project: 'Flink'
  1. Flink
  2. FLINK-17637

HadoopS3RecoverableWriterITCase fails with Expected exception: java.io.FileNotFoundException

    XMLWordPrintableJSON

    Details

      Description

      https://dev.azure.com/apache-flink/apache-flink/_build/results?buildId=1084&view=logs&j=d44f43ce-542c-597d-bf94-b0718c71e5e8&t=34f486e1-e1e4-5dd2-9c06-bfdd9b9c74a8

      [ERROR] Tests run: 13, Failures: 1, Errors: 0, Skipped: 0, Time elapsed: 70.885 s <<< FAILURE! - in org.apache.flink.fs.s3hadoop.HadoopS3RecoverableWriterITCase
      [ERROR] testCleanupRecoverableState(org.apache.flink.fs.s3hadoop.HadoopS3RecoverableWriterITCase)  Time elapsed: 4.864 s  <<< FAILURE!
      java.lang.AssertionError: Expected exception: java.io.FileNotFoundException
      	at org.junit.internal.runners.statements.ExpectException.evaluate(ExpectException.java:32)
      	at org.junit.internal.runners.statements.RunBefores.evaluate(RunBefores.java:26)
      	at org.junit.internal.runners.statements.RunAfters.evaluate(RunAfters.java:27)
      	at org.junit.rules.TestWatcher$1.evaluate(TestWatcher.java:55)
      	at org.junit.rules.RunRules.evaluate(RunRules.java:20)
      	at org.junit.runners.ParentRunner.runLeaf(ParentRunner.java:325)
      	at org.junit.runners.BlockJUnit4ClassRunner.runChild(BlockJUnit4ClassRunner.java:78)
      	at org.junit.runners.BlockJUnit4ClassRunner.runChild(BlockJUnit4ClassRunner.java:57)
      	at org.junit.runners.ParentRunner$3.run(ParentRunner.java:290)
      	at org.junit.runners.ParentRunner$1.schedule(ParentRunner.java:71)
      	at org.junit.runners.ParentRunner.runChildren(ParentRunner.java:288)
      	at org.junit.runners.ParentRunner.access$000(ParentRunner.java:58)
      	at org.junit.runners.ParentRunner$2.evaluate(ParentRunner.java:268)
      	at org.junit.internal.runners.statements.RunBefores.evaluate(RunBefores.java:26)
      	at org.junit.internal.runners.statements.RunAfters.evaluate(RunAfters.java:27)
      	at org.junit.rules.ExternalResource$1.evaluate(ExternalResource.java:48)
      	at org.junit.rules.RunRules.evaluate(RunRules.java:20)
      	at org.junit.runners.ParentRunner.run(ParentRunner.java:363)
      	at org.apache.maven.surefire.junit4.JUnit4Provider.execute(JUnit4Provider.java:365)
      	at org.apache.maven.surefire.junit4.JUnit4Provider.executeWithRerun(JUnit4Provider.java:273)
      	at org.apache.maven.surefire.junit4.JUnit4Provider.executeTestSet(JUnit4Provider.java:238)
      	at org.apache.maven.surefire.junit4.JUnit4Provider.invoke(JUnit4Provider.java:159)
      	at org.apache.maven.surefire.booter.ForkedBooter.invokeProviderInSameClassLoader(ForkedBooter.java:384)
      	at org.apache.maven.surefire.booter.ForkedBooter.runSuitesInProcess(ForkedBooter.java:345)
      	at org.apache.maven.surefire.booter.ForkedBooter.execute(ForkedBooter.java:126)
      	at org.apache.maven.surefire.booter.ForkedBooter.main(ForkedBooter.java:418)
      
      

        Attachments

          Issue Links

            Activity

              People

              • Assignee:
                maguowei Guowei Ma
                Reporter:
                rmetzger Robert Metzger
              • Votes:
                0 Vote for this issue
                Watchers:
                4 Start watching this issue

                Dates

                • Created:
                  Updated:
                  Resolved: