Uploaded image for project: 'Flink'
  1. Flink
  2. FLINK-13906

ExecutionConfigTests.test_equals_and_hash failed on Travis

    XMLWordPrintableJSON

    Details

      Description

      The ExecutionConfigTests.test_equals_and_hash Python test failed on Travis with

      =================================== FAILURES ===================================
      __________________ ExecutionConfigTests.test_equals_and_hash ___________________
      
      self = <pyflink.common.tests.test_execution_config.ExecutionConfigTests testMethod=test_equals_and_hash>
      
          def test_equals_and_hash(self):
          
              config1 = ExecutionEnvironment.get_execution_environment().get_config()
          
              config2 = ExecutionEnvironment.get_execution_environment().get_config()
          
              self.assertEqual(config1, config2)
          
      >       self.assertEqual(hash(config1), hash(config2))
      E       AssertionError: 1609772339 != -295934785
      
      pyflink/common/tests/test_execution_config.py:277: AssertionError
      ==================== 1 failed, 373 passed in 50.62 seconds =====================
      ERROR: InvocationError for command /home/travis/build/flink-ci/flink/flink-python/.tox/py27/bin/pytest (exited with code 1)
      

      https://api.travis-ci.com/v3/job/229361674/log.txt

        Attachments

          Issue Links

            Activity

              People

              • Assignee:
                WeiZhong Wei Zhong
                Reporter:
                trohrmann Till Rohrmann
              • Votes:
                0 Vote for this issue
                Watchers:
                4 Start watching this issue

                Dates

                • Created:
                  Updated:
                  Resolved:

                  Time Tracking

                  Estimated:
                  Original Estimate - Not Specified
                  Not Specified
                  Remaining:
                  Remaining Estimate - 0h
                  0h
                  Logged:
                  Time Spent - 20m
                  20m