Uploaded image for project: 'Apache Fineract'
  1. Apache Fineract
  2. FINERACT-898

Test failures due to XmlBeanDefinitionStoreException Caused by: org.xml.sax.SAXParseException

VotersWatch issueWatchersLinkCloneUpdate Comment AuthorReplace String in CommentUpdate Comment VisibilityDelete Comments
    XMLWordPrintableJSON

    Details

    • Type: Bug
    • Status: Closed
    • Priority: Major
    • Resolution: Fixed
    • Affects Version/s: None
    • Fix Version/s: 1.5.0
    • Component/s: None
    • Labels:
      None

      Description

      https://travis-ci.org/github/apache/fineract/builds/676411255 for https://github.com/apache/fineract/pull/763 just failed due to:

      > Task :test
      
      org.apache.fineract.infrastructure.configuration.spring.SpringConfigurationTest > testSpringXMLConfiguration FAILED
      
          java.lang.IllegalStateException at DefaultCacheAwareContextLoaderDelegate.java:132
      
              Caused by: org.springframework.beans.factory.xml.XmlBeanDefinitionStoreException at XmlBeanDefinitionReader.java:405
      
                  Caused by: org.xml.sax.SAXParseException at null:-1
      
      org.apache.fineract.commands.provider.CommandHandlerProviderTest > shouldThrowUnsupportedCommandException FAILED
      
          java.lang.IllegalStateException at DefaultCacheAwareContextLoaderDelegate.java:132
      
              Caused by: org.springframework.beans.factory.xml.XmlBeanDefinitionStoreException at XmlBeanDefinitionReader.java:405
      
                  Caused by: org.xml.sax.SAXParseException at null:-1
      
      org.apache.fineract.commands.provider.CommandHandlerProviderTest > shouldRegisterHandler FAILED
      
          java.lang.IllegalStateException at DefaultCacheAwareContextLoaderDelegate.java:132
      
              Caused by: org.springframework.beans.factory.xml.XmlBeanDefinitionStoreException at XmlBeanDefinitionReader.java:405
      
                  Caused by: org.xml.sax.SAXParseException at null:-1
      
      23 tests completed, 3 failed

      This makes very little sense - that PR didn't touch Spring XML files...

      I don't understand if and how this be another "spurious" test failure...

        Attachments

        Issue Links

          Activity

            People

            • Assignee:
              vorburger Michael Vorburger
              Reporter:
              vorburger Michael Vorburger

              Dates

              • Created:
                Updated:
                Resolved:

                Issue deployment