Uploaded image for project: 'Falcon'
  1. Falcon
  2. FALCON-2016

maven assembly:single fails on MacOS

    XMLWordPrintableJSON

Details

    • Bug
    • Status: Resolved
    • Major
    • Resolution: Fixed
    • None
    • trunk, 0.10
    • None
    • None

    Description

      [INFO] Apache Falcon Distro ............................... FAILURE [ 14.145 s]
      [INFO] ------------------------------------------------------------------------
      [INFO] BUILD FAILURE
      [INFO] ------------------------------------------------------------------------
      [INFO] Total time: 11:38 min
      [INFO] Finished at: 2016-06-07T13:02:28+05:30
      [INFO] Final Memory: 363M/914M
      [INFO] ------------------------------------------------------------------------
      [ERROR] Failed to execute goal org.apache.maven.plugins:maven-assembly-plugin:2.6:single (dist-assembly) on project falcon-distro: Execution dist-assembly of goal org.apache.maven.plugins:maven-assembly-plugin:2.6:single failed: group id '1114871328' is too big ( > 2097151 ). Use STAR or POSIX extensions to overcome this limit -> [Help 1]

      Attachments

        Issue Links

          Activity

            People

              pallavi.rao Pallavi Rao
              pallavi.rao Pallavi Rao
              Votes:
              0 Vote for this issue
              Watchers:
              2 Start watching this issue

              Dates

                Created:
                Updated:
                Resolved: