Uploaded image for project: 'Qpid Dispatch'
  1. Qpid Dispatch
  2. DISPATCH-2164

test_26_multicast_mobile_address_edge_to_interior failing in system_tests_edge_router

    XMLWordPrintableJSON

    Details

    • Type: Test
    • Status: Resolved
    • Priority: Major
    • Resolution: Fixed
    • Affects Version/s: 1.16.0
    • Fix Version/s: 1.18.0
    • Component/s: Tests
    • Labels:
      None

      Description

      55: <<<<
      55: 
      55: ======================================================================
      55: FAIL: test_26_multicast_mobile_address_edge_to_interior (system_tests_edge_router.RouterTest)
      55: ----------------------------------------------------------------------
      55: Traceback (most recent call last):
      55:   File "/home/travis/build/apache/qpid-dispatch/tests/system_tests_edge_router.py", line 663, in test_26_multicast_mobile_address_edge_to_interior
      55:     self.assertIsNone(test.error)
      55: AssertionError: 'Timeout Expired - n_sent=100 n_rcvd1=100, n_rcvd2=99, n_rcvd3=99, n_released=0, addr=multicast.26' is not None
      55: 
      55: ----------------------------------------------------------------------
      55: Ran 89 tests in 545.208s
      55: 
      55: FAILED (failures=1)
      55/72 Test #55: system_tests_edge_router ..........................***Failed  545.35 sec 

        Attachments

          Activity

            People

            • Assignee:
              gmurthy Ganesh Murthy
              Reporter:
              gmurthy Ganesh Murthy
            • Votes:
              0 Vote for this issue
              Watchers:
              4 Start watching this issue

              Dates

              • Created:
                Updated:
                Resolved: