Uploaded image for project: 'Qpid Dispatch'
  1. Qpid Dispatch
  2. DISPATCH-1433

system_tests_delivery_abort failing due to receiver connecting late

    XMLWordPrintableJSON

    Details

    • Type: Bug
    • Status: Resolved
    • Priority: Major
    • Resolution: Fixed
    • Affects Version/s: 1.9.0
    • Fix Version/s: 1.10.0
    • Component/s: Tests
    • Labels:
      None

      Description

      "40: test_07_multicast_truncate_one_router (system_tests_delivery_abort.RouterTest) ... FAIL", 
              "40: ", 
              "40: ======================================================================", 
              "40: FAIL: test_07_multicast_truncate_one_router (system_tests_delivery_abort.RouterTest)", 
              "40: ----------------------------------------------------------------------", 
              "40: Traceback (most recent call last):", 
              "40:   File \"/opt/qpid-dispatch-src/tests/system_tests_delivery_abort.py\", line 127, in test_07_multicast_truncate_one_router", 
              "40:     self.assertEqual(None, test.error)", 
              "40: AssertionError: None != u\"Expected: [u'Send_Short_1', u'Aborted_Delivery', u'2', u'2', u'2', u'2', u'2', u'2', u'2', u'2', u'2', u'2', u'Send_Short_2', u'3', u'3', u'3', u'3', u'3', u'3', u'3', u'3', u'3', u'3', u'Send_Short_3'], Actuals: [u'Aborted_Delivery', u'2', u'2', u'2', u'2', u'2', u'2', u'2', u'2', u'2', u'2', u'Send_Short_2', u'3', u'3', u'3', u'3', u'3', u'3', u'3', u'3', u'3', u'3', u'Send_Short_3'], [u'Send_Short_1', u'Aborted_Delivery', u'2', u'2', u'2', u'2', u'2', u'2', u'2', u'2', u'2', u'2', u'Send_Short_2', u'3', u'3', u'3', u'3', u'3', u'3', u'3', u'3', u'3', u'3', u'Send_Short_3']\"", 
              "40: ", 
              "40: ----------------------------------------------------------------------", 
              "40: Ran 7 tests in 15.769s", 
              "40: ", 
              "40: FAILED (failures=1)", 
              "40/59 Test #40: system_tests_delivery_abort .......................***Failed   15.93 sec", 
              "test 41",  

        Attachments

          Activity

            People

            • Assignee:
              gmurthy Ganesh Murthy
              Reporter:
              gmurthy Ganesh Murthy
            • Votes:
              0 Vote for this issue
              Watchers:
              1 Start watching this issue

              Dates

              • Created:
                Updated:
                Resolved: