Derby
  1. Derby
  2. DERBY-5686

multiple intermittent errors in nightly tests during DriverMgrAuthenticationTest test. reason: An SQL data change is not permitted for a read-only connection, user or database.

    Details

    • Type: Bug Bug
    • Status: Open
    • Priority: Major Major
    • Resolution: Unresolved
    • Affects Version/s: 10.10.2.0
    • Fix Version/s: None
    • Component/s: Test
    • Environment:
    • Urgency:
      Normal
    • Bug behavior facts:
      Regression Test Failure

      Description

      8 errors in nightly test runs on 4/4/2012 against trunk, windows, ibm16, build 1310147 . Tests passed against same build, same machine on ibm15 and ibm17
      http://people.apache.org/~myrnavl/derby_test_results/main/windows/testlog/ibm16/1310147-suites.All_diff.txt
      There were 8 errors:
      1) testNotFullAccessUsers(org.apache.derbyTesting.functionTests.tests.jdbcapi.DriverMgrAuthenticationTest)java.sql.SQLException: An SQL data change is not permitted for a read-only connection, user or database.
      at org.apache.derby.client.am.SQLExceptionFactory40.getSQLException(Unknown Source)
      at org.apache.derby.client.am.SqlException.getSQLException(Unknown Source)
      at org.apache.derby.client.am.PreparedStatement.executeUpdate(Unknown Source)
      at org.apache.derbyTesting.junit.DatabasePropertyTestSetup.setProperties(DatabasePropertyTestSetup.java:352)
      at org.apache.derbyTesting.junit.DatabasePropertyTestSetup.setUp(DatabasePropertyTestSetup.java:268)
      at junit.extensions.TestSetup$1.protect(TestSetup.java:20)
      at junit.extensions.TestSetup.run(TestSetup.java:25)
      at org.apache.derbyTesting.junit.BaseTestSetup.run(BaseTestSetup.java:57)
      at junit.extensions.TestDecorator.basicRun(TestDecorator.java:24)
      at junit.extensions.TestSetup$1.protect(TestSetup.java:21)
      at junit.extensions.TestSetup.run(TestSetup.java:25)
      at org.apache.derbyTesting.junit.BaseTestSetup.run(BaseTestSetup.java:57)
      at junit.extensions.TestDecorator.basicRun(TestDecorator.java:24)
      at junit.extensions.TestSetup$1.protect(TestSetup.java:21)
      at junit.extensions.TestSetup.run(TestSetup.java:25)
      at junit.extensions.TestDecorator.basicRun(TestDecorator.java:24)
      at junit.extensions.TestSetup$1.protect(TestSetup.java:21)
      at junit.extensions.TestSetup.run(TestSetup.java:25)
      at org.apache.derbyTesting.junit.BaseTestSetup.run(BaseTestSetup.java:57)
      at junit.extensions.TestDecorator.basicRun(TestDecorator.java:24)
      at junit.extensions.TestSetup$1.protect(TestSetup.java:21)
      at junit.extensions.TestSetup.run(TestSetup.java:25)
      at junit.extensions.TestDecorator.basicRun(TestDecorator.java:24)
      at junit.extensions.TestSetup$1.protect(TestSetup.java:21)
      at junit.extensions.TestSetup.run(TestSetup.java:25)
      at org.apache.derbyTesting.junit.BaseTestSetup.run(BaseTestSetup.java:57)
      at junit.extensions.TestDecorator.basicRun(TestDecorator.java:24)
      at junit.extensions.TestSetup$1.protect(TestSetup.java:21)
      at junit.extensions.TestSetup.run(TestSetup.java:25)
      Caused by: org.apache.derby.client.am.SqlException: An SQL data change is not permitted for a read-only connection, user or database.
      at org.apache.derby.client.am.Statement.completeExecute(Unknown Source)
      at org.apache.derby.client.net.NetStatementReply.parseEXCSQLSTTreply(Unknown Source)
      at org.apache.derby.client.net.NetStatementReply.readExecuteCall(Unknown Source)
      at org.apache.derby.client.net.StatementReply.readExecuteCall(Unknown Source)
      at org.apache.derby.client.net.NetStatement.readExecuteCall_(Unknown Source)
      at org.apache.derby.client.am.Statement.readExecuteCall(Unknown Source)
      at org.apache.derby.client.am.PreparedStatement.flowExecute(Unknown Source)
      at org.apache.derby.client.am.PreparedStatement.executeUpdateX(Unknown Source)
      ... 47 more
      2) testNotFullAccessUsers(org.apache.derbyTesting.functionTests.tests.jdbcapi.DriverMgrAuthenticationTest)java.sql.SQLException: An SQL data change is not permitted for a read-only connection, user or database.
      at org.apache.derby.client.am.SQLExceptionFactory40.getSQLException(Unknown Source)
      at org.apache.derby.client.am.SqlException.getSQLException(Unknown Source)
      at org.apache.derby.client.am.PreparedStatement.executeUpdate(Unknown Source)
      at org.apache.derbyTesting.junit.DatabasePropertyTestSetup.tearDown(DatabasePropertyTestSetup.java:294)
      at junit.extensions.TestSetup$1.protect(TestSetup.java:22)
      at junit.extensions.TestSetup.run(TestSetup.java:25)
      at org.apache.derbyTesting.junit.BaseTestSetup.run(BaseTestSetup.java:57)
      at junit.extensions.TestDecorator.basicRun(TestDecorator.java:24)
      at junit.extensions.TestSetup$1.protect(TestSetup.java:21)
      at junit.extensions.TestSetup.run(TestSetup.java:25)
      at junit.extensions.TestDecorator.basicRun(TestDecorator.java:24)
      at junit.extensions.TestSetup$1.protect(TestSetup.java:21)
      at junit.extensions.TestSetup.run(TestSetup.java:25)
      at org.apache.derbyTesting.junit.BaseTestSetup.run(BaseTestSetup.java:57)
      at junit.extensions.TestDecorator.basicRun(TestDecorator.java:24)
      at junit.extensions.TestSetup$1.protect(TestSetup.java:21)
      at junit.extensions.TestSetup.run(TestSetup.java:25)
      at junit.extensions.TestDecorator.basicRun(TestDecorator.java:24)
      at junit.extensions.TestSetup$1.protect(TestSetup.java:21)
      at junit.extensions.TestSetup.run(TestSetup.java:25)
      at org.apache.derbyTesting.junit.BaseTestSetup.run(BaseTestSetup.java:57)
      at junit.extensions.TestDecorator.basicRun(TestDecorator.java:24)
      at junit.extensions.TestSetup$1.protect(TestSetup.java:21)
      at junit.extensions.TestSetup.run(TestSetup.java:25)
      Caused by: org.apache.derby.client.am.SqlException: An SQL data change is not permitted for a read-only connection, user or database.
      at org.apache.derby.client.am.Statement.completeExecute(Unknown Source)
      at org.apache.derby.client.net.NetStatementReply.parseEXCSQLSTTreply(Unknown Source)
      at org.apache.derby.client.net.NetStatementReply.readExecuteCall(Unknown Source)
      at org.apache.derby.client.net.StatementReply.readExecuteCall(Unknown Source)
      at org.apache.derby.client.net.NetStatement.readExecuteCall_(Unknown Source)
      at org.apache.derby.client.am.Statement.readExecuteCall(Unknown Source)
      at org.apache.derby.client.am.PreparedStatement.flowExecute(Unknown Source)
      at org.apache.derby.client.am.PreparedStatement.executeUpdateX(Unknown Source)
      ... 41 more
      3) testChangePasswordAndDatabasePropertiesOnly(org.apache.derbyTesting.functionTests.tests.jdbcapi.DriverMgrAuthenticationTest)java.sql.SQLException: An SQL data change is not permitted for a read-only connection, user or database.
      at org.apache.derby.client.am.SQLExceptionFactory40.getSQLException(Unknown Source)
      at org.apache.derby.client.am.SqlException.getSQLException(Unknown Source)
      at org.apache.derby.client.am.PreparedStatement.executeUpdate(Unknown Source)
      at org.apache.derbyTesting.junit.DatabasePropertyTestSetup.setProperties(DatabasePropertyTestSetup.java:352)
      at org.apache.derbyTesting.junit.DatabasePropertyTestSetup.setUp(DatabasePropertyTestSetup.java:268)
      at junit.extensions.TestSetup$1.protect(TestSetup.java:20)
      at junit.extensions.TestSetup.run(TestSetup.java:25)
      at org.apache.derbyTesting.junit.BaseTestSetup.run(BaseTestSetup.java:57)
      at junit.extensions.TestDecorator.basicRun(TestDecorator.java:24)
      at junit.extensions.TestSetup$1.protect(TestSetup.java:21)
      at junit.extensions.TestSetup.run(TestSetup.java:25)
      at org.apache.derbyTesting.junit.BaseTestSetup.run(BaseTestSetup.java:57)
      at junit.extensions.TestDecorator.basicRun(TestDecorator.java:24)
      at junit.extensions.TestSetup$1.protect(TestSetup.java:21)
      at junit.extensions.TestSetup.run(TestSetup.java:25)
      at junit.extensions.TestDecorator.basicRun(TestDecorator.java:24)
      at junit.extensions.TestSetup$1.protect(TestSetup.java:21)
      at junit.extensions.TestSetup.run(TestSetup.java:25)
      at org.apache.derbyTesting.junit.BaseTestSetup.run(BaseTestSetup.java:57)
      at junit.extensions.TestDecorator.basicRun(TestDecorator.java:24)
      at junit.extensions.TestSetup$1.protect(TestSetup.java:21)
      at junit.extensions.TestSetup.run(TestSetup.java:25)
      at junit.extensions.TestDecorator.basicRun(TestDecorator.java:24)
      at junit.extensions.TestSetup$1.protect(TestSetup.java:21)
      at junit.extensions.TestSetup.run(TestSetup.java:25)
      at org.apache.derbyTesting.junit.BaseTestSetup.run(BaseTestSetup.java:57)
      at junit.extensions.TestDecorator.basicRun(TestDecorator.java:24)
      at junit.extensions.TestSetup$1.protect(TestSetup.java:21)
      at junit.extensions.TestSetup.run(TestSetup.java:25)
      Caused by: org.apache.derby.client.am.SqlException: An SQL data change is not permitted for a read-only connection, user or database.
      at org.apache.derby.client.am.Statement.completeExecute(Unknown Source)
      at org.apache.derby.client.net.NetStatementReply.parseEXCSQLSTTreply(Unknown Source)
      at org.apache.derby.client.net.NetStatementReply.readExecuteCall(Unknown Source)
      at org.apache.derby.client.net.StatementReply.readExecuteCall(Unknown Source)
      at org.apache.derby.client.net.NetStatement.readExecuteCall_(Unknown Source)
      at org.apache.derby.client.am.Statement.readExecuteCall(Unknown Source)
      at org.apache.derby.client.am.PreparedStatement.flowExecute(Unknown Source)
      at org.apache.derby.client.am.PreparedStatement.executeUpdateX(Unknown Source)
      ... 47 more
      4) testChangePasswordAndDatabasePropertiesOnly(org.apache.derbyTesting.functionTests.tests.jdbcapi.DriverMgrAuthenticationTest)java.sql.SQLException: An SQL data change is not permitted for a read-only connection, user or database.
      at org.apache.derby.client.am.SQLExceptionFactory40.getSQLException(Unknown Source)
      at org.apache.derby.client.am.SqlException.getSQLException(Unknown Source)
      at org.apache.derby.client.am.PreparedStatement.executeUpdate(Unknown Source)
      at org.apache.derbyTesting.junit.DatabasePropertyTestSetup.tearDown(DatabasePropertyTestSetup.java:294)
      at junit.extensions.TestSetup$1.protect(TestSetup.java:22)
      at junit.extensions.TestSetup.run(TestSetup.java:25)
      at org.apache.derbyTesting.junit.BaseTestSetup.run(BaseTestSetup.java:57)
      at junit.extensions.TestDecorator.basicRun(TestDecorator.java:24)
      at junit.extensions.TestSetup$1.protect(TestSetup.java:21)
      at junit.extensions.TestSetup.run(TestSetup.java:25)
      at junit.extensions.TestDecorator.basicRun(TestDecorator.java:24)
      at junit.extensions.TestSetup$1.protect(TestSetup.java:21)
      at junit.extensions.TestSetup.run(TestSetup.java:25)
      at org.apache.derbyTesting.junit.BaseTestSetup.run(BaseTestSetup.java:57)
      at junit.extensions.TestDecorator.basicRun(TestDecorator.java:24)
      at junit.extensions.TestSetup$1.protect(TestSetup.java:21)
      at junit.extensions.TestSetup.run(TestSetup.java:25)
      at junit.extensions.TestDecorator.basicRun(TestDecorator.java:24)
      at junit.extensions.TestSetup$1.protect(TestSetup.java:21)
      at junit.extensions.TestSetup.run(TestSetup.java:25)
      at org.apache.derbyTesting.junit.BaseTestSetup.run(BaseTestSetup.java:57)
      at junit.extensions.TestDecorator.basicRun(TestDecorator.java:24)
      at junit.extensions.TestSetup$1.protect(TestSetup.java:21)
      at junit.extensions.TestSetup.run(TestSetup.java:25)
      Caused by: org.apache.derby.client.am.SqlException: An SQL data change is not permitted for a read-only connection, user or database.
      at org.apache.derby.client.am.Statement.completeExecute(Unknown Source)
      at org.apache.derby.client.net.NetStatementReply.parseEXCSQLSTTreply(Unknown Source)
      at org.apache.derby.client.net.NetStatementReply.readExecuteCall(Unknown Source)
      at org.apache.derby.client.net.StatementReply.readExecuteCall(Unknown Source)
      at org.apache.derby.client.net.NetStatement.readExecuteCall_(Unknown Source)
      at org.apache.derby.client.am.Statement.readExecuteCall(Unknown Source)
      at org.apache.derby.client.am.PreparedStatement.flowExecute(Unknown Source)
      at org.apache.derby.client.am.PreparedStatement.executeUpdateX(Unknown Source)
      ... 41 more
      5) testGreekCharacters(org.apache.derbyTesting.functionTests.tests.jdbcapi.DriverMgrAuthenticationTest)java.sql.SQLException: An SQL data change is not permitted for a read-only connection, user or database.
      at org.apache.derby.client.am.SQLExceptionFactory40.getSQLException(Unknown Source)
      at org.apache.derby.client.am.SqlException.getSQLException(Unknown Source)
      at org.apache.derby.client.am.PreparedStatement.executeUpdate(Unknown Source)
      at org.apache.derbyTesting.junit.DatabasePropertyTestSetup.setProperties(DatabasePropertyTestSetup.java:352)
      at org.apache.derbyTesting.junit.DatabasePropertyTestSetup.setUp(DatabasePropertyTestSetup.java:268)
      at junit.extensions.TestSetup$1.protect(TestSetup.java:20)
      at junit.extensions.TestSetup.run(TestSetup.java:25)
      at org.apache.derbyTesting.junit.BaseTestSetup.run(BaseTestSetup.java:57)
      at junit.extensions.TestDecorator.basicRun(TestDecorator.java:24)
      at junit.extensions.TestSetup$1.protect(TestSetup.java:21)
      at junit.extensions.TestSetup.run(TestSetup.java:25)
      at org.apache.derbyTesting.junit.BaseTestSetup.run(BaseTestSetup.java:57)
      at junit.extensions.TestDecorator.basicRun(TestDecorator.java:24)
      at junit.extensions.TestSetup$1.protect(TestSetup.java:21)
      at junit.extensions.TestSetup.run(TestSetup.java:25)
      at junit.extensions.TestDecorator.basicRun(TestDecorator.java:24)
      at junit.extensions.TestSetup$1.protect(TestSetup.java:21)
      at junit.extensions.TestSetup.run(TestSetup.java:25)
      at org.apache.derbyTesting.junit.BaseTestSetup.run(BaseTestSetup.java:57)
      at junit.extensions.TestDecorator.basicRun(TestDecorator.java:24)
      at junit.extensions.TestSetup$1.protect(TestSetup.java:21)
      at junit.extensions.TestSetup.run(TestSetup.java:25)
      at junit.extensions.TestDecorator.basicRun(TestDecorator.java:24)
      at junit.extensions.TestSetup$1.protect(TestSetup.java:21)
      at junit.extensions.TestSetup.run(TestSetup.java:25)
      at org.apache.derbyTesting.junit.BaseTestSetup.run(BaseTestSetup.java:57)
      at junit.extensions.TestDecorator.basicRun(TestDecorator.java:24)
      at junit.extensions.TestSetup$1.protect(TestSetup.java:21)
      at junit.extensions.TestSetup.run(TestSetup.java:25)
      Caused by: org.apache.derby.client.am.SqlException: An SQL data change is not permitted for a read-only connection, user or database.
      at org.apache.derby.client.am.Statement.completeExecute(Unknown Source)
      at org.apache.derby.client.net.NetStatementReply.parseEXCSQLSTTreply(Unknown Source)
      at org.apache.derby.client.net.NetStatementReply.readExecuteCall(Unknown Source)
      at org.apache.derby.client.net.StatementReply.readExecuteCall(Unknown Source)
      at org.apache.derby.client.net.NetStatement.readExecuteCall_(Unknown Source)
      at org.apache.derby.client.am.Statement.readExecuteCall(Unknown Source)
      at org.apache.derby.client.am.PreparedStatement.flowExecute(Unknown Source)
      at org.apache.derby.client.am.PreparedStatement.executeUpdateX(Unknown Source)
      ... 47 more
      6) testGreekCharacters(org.apache.derbyTesting.functionTests.tests.jdbcapi.DriverMgrAuthenticationTest)java.sql.SQLException: An SQL data change is not permitted for a read-only connection, user or database.
      at org.apache.derby.client.am.SQLExceptionFactory40.getSQLException(Unknown Source)
      at org.apache.derby.client.am.SqlException.getSQLException(Unknown Source)
      at org.apache.derby.client.am.PreparedStatement.executeUpdate(Unknown Source)
      at org.apache.derbyTesting.junit.DatabasePropertyTestSetup.tearDown(DatabasePropertyTestSetup.java:294)
      at junit.extensions.TestSetup$1.protect(TestSetup.java:22)
      at junit.extensions.TestSetup.run(TestSetup.java:25)
      at org.apache.derbyTesting.junit.BaseTestSetup.run(BaseTestSetup.java:57)
      at junit.extensions.TestDecorator.basicRun(TestDecorator.java:24)
      at junit.extensions.TestSetup$1.protect(TestSetup.java:21)
      at junit.extensions.TestSetup.run(TestSetup.java:25)
      at junit.extensions.TestDecorator.basicRun(TestDecorator.java:24)
      at junit.extensions.TestSetup$1.protect(TestSetup.java:21)
      at junit.extensions.TestSetup.run(TestSetup.java:25)
      at org.apache.derbyTesting.junit.BaseTestSetup.run(BaseTestSetup.java:57)
      at junit.extensions.TestDecorator.basicRun(TestDecorator.java:24)
      at junit.extensions.TestSetup$1.protect(TestSetup.java:21)
      at junit.extensions.TestSetup.run(TestSetup.java:25)
      at junit.extensions.TestDecorator.basicRun(TestDecorator.java:24)
      at junit.extensions.TestSetup$1.protect(TestSetup.java:21)
      at junit.extensions.TestSetup.run(TestSetup.java:25)
      at org.apache.derbyTesting.junit.BaseTestSetup.run(BaseTestSetup.java:57)
      at junit.extensions.TestDecorator.basicRun(TestDecorator.java:24)
      at junit.extensions.TestSetup$1.protect(TestSetup.java:21)
      at junit.extensions.TestSetup.run(TestSetup.java:25)
      Caused by: org.apache.derby.client.am.SqlException: An SQL data change is not permitted for a read-only connection, user or database.
      at org.apache.derby.client.am.Statement.completeExecute(Unknown Source)
      at org.apache.derby.client.net.NetStatementReply.parseEXCSQLSTTreply(Unknown Source)
      at org.apache.derby.client.net.NetStatementReply.readExecuteCall(Unknown Source)
      at org.apache.derby.client.net.StatementReply.readExecuteCall(Unknown Source)
      at org.apache.derby.client.net.NetStatement.readExecuteCall_(Unknown Source)
      at org.apache.derby.client.am.Statement.readExecuteCall(Unknown Source)
      at org.apache.derby.client.am.PreparedStatement.flowExecute(Unknown Source)
      at org.apache.derby.client.am.PreparedStatement.executeUpdateX(Unknown Source)
      ... 41 more
      7) testSystemShutdown(org.apache.derbyTesting.functionTests.tests.jdbcapi.DriverMgrAuthenticationTest)java.sql.SQLException: An SQL data change is not permitted for a read-only connection, user or database.
      at org.apache.derby.client.am.SQLExceptionFactory40.getSQLException(Unknown Source)
      at org.apache.derby.client.am.SqlException.getSQLException(Unknown Source)
      at org.apache.derby.client.am.PreparedStatement.executeUpdate(Unknown Source)
      at org.apache.derbyTesting.junit.DatabasePropertyTestSetup.setProperties(DatabasePropertyTestSetup.java:352)
      at org.apache.derbyTesting.junit.DatabasePropertyTestSetup.setUp(DatabasePropertyTestSetup.java:268)
      at junit.extensions.TestSetup$1.protect(TestSetup.java:20)
      at junit.extensions.TestSetup.run(TestSetup.java:25)
      at org.apache.derbyTesting.junit.BaseTestSetup.run(BaseTestSetup.java:57)
      at junit.extensions.TestDecorator.basicRun(TestDecorator.java:24)
      at junit.extensions.TestSetup$1.protect(TestSetup.java:21)
      at junit.extensions.TestSetup.run(TestSetup.java:25)
      at org.apache.derbyTesting.junit.BaseTestSetup.run(BaseTestSetup.java:57)
      at junit.extensions.TestDecorator.basicRun(TestDecorator.java:24)
      at junit.extensions.TestSetup$1.protect(TestSetup.java:21)
      at junit.extensions.TestSetup.run(TestSetup.java:25)
      at junit.extensions.TestDecorator.basicRun(TestDecorator.java:24)
      at junit.extensions.TestSetup$1.protect(TestSetup.java:21)
      at junit.extensions.TestSetup.run(TestSetup.java:25)
      at org.apache.derbyTesting.junit.BaseTestSetup.run(BaseTestSetup.java:57)
      at junit.extensions.TestDecorator.basicRun(TestDecorator.java:24)
      at junit.extensions.TestSetup$1.protect(TestSetup.java:21)
      at junit.extensions.TestSetup.run(TestSetup.java:25)
      at junit.extensions.TestDecorator.basicRun(TestDecorator.java:24)
      at junit.extensions.TestSetup$1.protect(TestSetup.java:21)
      at junit.extensions.TestSetup.run(TestSetup.java:25)
      at org.apache.derbyTesting.junit.BaseTestSetup.run(BaseTestSetup.java:57)
      at junit.extensions.TestDecorator.basicRun(TestDecorator.java:24)
      at junit.extensions.TestSetup$1.protect(TestSetup.java:21)
      at junit.extensions.TestSetup.run(TestSetup.java:25)
      Caused by: org.apache.derby.client.am.SqlException: An SQL data change is not permitted for a read-only connection, user or database.
      at org.apache.derby.client.am.Statement.completeExecute(Unknown Source)
      at org.apache.derby.client.net.NetStatementReply.parseEXCSQLSTTreply(Unknown Source)
      at org.apache.derby.client.net.NetStatementReply.readExecuteCall(Unknown Source)
      at org.apache.derby.client.net.StatementReply.readExecuteCall(Unknown Source)
      at org.apache.derby.client.net.NetStatement.readExecuteCall_(Unknown Source)
      at org.apache.derby.client.am.Statement.readExecuteCall(Unknown Source)
      at org.apache.derby.client.am.PreparedStatement.flowExecute(Unknown Source)
      at org.apache.derby.client.am.PreparedStatement.executeUpdateX(Unknown Source)
      ... 47 more
      8) testSystemShutdown(org.apache.derbyTesting.functionTests.tests.jdbcapi.DriverMgrAuthenticationTest)java.sql.SQLException: An SQL data change is not permitted for a read-only connection, user or database.
      at org.apache.derby.client.am.SQLExceptionFactory40.getSQLException(Unknown Source)
      at org.apache.derby.client.am.SqlException.getSQLException(Unknown Source)
      at org.apache.derby.client.am.PreparedStatement.executeUpdate(Unknown Source)
      at org.apache.derbyTesting.junit.DatabasePropertyTestSetup.tearDown(DatabasePropertyTestSetup.java:294)
      at junit.extensions.TestSetup$1.protect(TestSetup.java:22)
      at junit.extensions.TestSetup.run(TestSetup.java:25)
      at org.apache.derbyTesting.junit.BaseTestSetup.run(BaseTestSetup.java:57)
      at junit.extensions.TestDecorator.basicRun(TestDecorator.java:24)
      at junit.extensions.TestSetup$1.protect(TestSetup.java:21)
      at junit.extensions.TestSetup.run(TestSetup.java:25)
      at junit.extensions.TestDecorator.basicRun(TestDecorator.java:24)
      at junit.extensions.TestSetup$1.protect(TestSetup.java:21)
      at junit.extensions.TestSetup.run(TestSetup.java:25)
      at org.apache.derbyTesting.junit.BaseTestSetup.run(BaseTestSetup.java:57)
      at junit.extensions.TestDecorator.basicRun(TestDecorator.java:24)
      at junit.extensions.TestSetup$1.protect(TestSetup.java:21)
      at junit.extensions.TestSetup.run(TestSetup.java:25)
      at junit.extensions.TestDecorator.basicRun(TestDecorator.java:24)
      at junit.extensions.TestSetup$1.protect(TestSetup.java:21)
      at junit.extensions.TestSetup.run(TestSetup.java:25)
      at org.apache.derbyTesting.junit.BaseTestSetup.run(BaseTestSetup.java:57)
      at junit.extensions.TestDecorator.basicRun(TestDecorator.java:24)
      at junit.extensions.TestSetup$1.protect(TestSetup.java:21)
      at junit.extensions.TestSetup.run(TestSetup.java:25)
      Caused by: org.apache.derby.client.am.SqlException: An SQL data change is not permitted for a read-only connection, user or database.
      at org.apache.derby.client.am.Statement.completeExecute(Unknown Source)
      at org.apache.derby.client.net.NetStatementReply.parseEXCSQLSTTreply(Unknown Source)
      at org.apache.derby.client.net.NetStatementReply.readExecuteCall(Unknown Source)
      at org.apache.derby.client.net.StatementReply.readExecuteCall(Unknown Source)
      at org.apache.derby.client.net.NetStatement.readExecuteCall_(Unknown Source)
      at org.apache.derby.client.am.Statement.readExecuteCall(Unknown Source)
      at org.apache.derby.client.am.PreparedStatement.flowExecute(Unknown Source)
      at org.apache.derby.client.am.PreparedStatement.executeUpdateX(Unknown Source)
      ... 41 more

      FAILURES!!!
      Tests run: 15467, Failures: 0, Errors: 8

      1. DERBY-5686_1.diff
        5 kB
        Myrna van Lunteren
      2. DERBY-5686_2.diff
        3 kB
        Myrna van Lunteren
      3. DERBY-5686_3.diff
        1 kB
        Kristian Waagan
      4. DERBY-5686_4.diff
        2 kB
        Myrna van Lunteren
      5. DERBY-5686_5.diff
        4 kB
        Myrna van Lunteren
      6. DERBY-5686_6.diff
        7 kB
        Myrna van Lunteren
      7. DERBY-5686_7.diff
        8 kB
        Myrna van Lunteren
      8. DERBY-5686-3a-add_missing_return.diff
        1 kB
        Kristian Waagan

        Issue Links

          Activity

          No work has yet been logged on this issue.

            People

            • Assignee:
              Unassigned
              Reporter:
              Mike Matrigali
            • Votes:
              0 Vote for this issue
              Watchers:
              2 Start watching this issue

              Dates

              • Created:
                Updated:

                Development