Derby
  1. Derby
  2. DERBY-5672

Multiple failures in jdbcapi.XADSAuthenticationTest starting with testUserFunctions(org.apache.derbyTesting.functionTests.tests.jdbcapi.XADSAuthenticajava.sql.SQLException: An SQL data change is not permitted for a read-only connection, user or database.

    Details

    • Type: Bug Bug
    • Status: Closed
    • Priority: Major Major
    • Resolution: Duplicate
    • Affects Version/s: 10.9.1.0
    • Fix Version/s: None
    • Component/s: JDBC
    • Labels:
      None
    • Bug behavior facts:
      Regression Test Failure

      Description

      Saw this MArch 24 in the IBM runs:

      http://people.apache.org/~myrnavl/derby_test_results/main/windows/testlog/ibm15/1304978-suites.All_diff.txt
      1) testUserFunctions(org.apache.derbyTesting.functionTests.tests.jdbcapi.XADSAuthenticationTest)java.sql.SQLException: An SQL data change is not permitted for a read-only connection, user or database.
      at org.apache.derby.impl.jdbc.SQLExceptionFactory.getSQLException(Unknown Source)
      at org.apache.derby.impl.jdbc.Util.generateCsSQLException(Unknown Source)
      at org.apache.derby.impl.jdbc.TransactionResourceImpl.wrapInSQLException(Unknown Source)
      at org.apache.derby.impl.jdbc.TransactionResourceImpl.handleException(Unknown Source)
      at org.apache.derby.impl.jdbc.EmbedConnection.handleException(Unknown Source)
      at org.apache.derby.impl.jdbc.ConnectionChild.handleException(Unknown Source)
      at org.apache.derby.impl.jdbc.EmbedStatement.executeStatement(Unknown Source)
      at org.apache.derby.impl.jdbc.EmbedPreparedStatement.executeStatement(Unknown Source)
      at org.apache.derby.impl.jdbc.EmbedCallableStatement.executeStatement(Unknown Source)
      at org.apache.derby.impl.jdbc.EmbedPreparedStatement.execute(Unknown Source)
      at org.apache.derbyTesting.functionTests.tests.jdbcapi.AuthenticationTest.setDatabaseProperty(AuthenticationTest.java:1297)
      at org.apache.derbyTesting.functionTests.tests.jdbcapi.AuthenticationTest.setUp(AuthenticationTest.java:192)
      at org.apache.derbyTesting.junit.BaseTestCase.runBare(BaseTestCase.java:113)
      at junit.extensions.TestDecorator.basicRun(TestDecorator.java:24)
      at junit.extensions.TestSetup$1.protect(TestSetup.java:21)
      at junit.extensions.TestSetup.run(TestSetup.java:25)
      at org.apache.derbyTesting.junit.BaseTestSetup.run(BaseTestSetup.java:57)
      at junit.extensions.TestDecorator.basicRun(TestDecorator.java:24)
      at junit.extensions.TestSetup$1.protect(TestSetup.java:21)
      at junit.extensions.TestSetup.run(TestSetup.java:25)
      at junit.extensions.TestDecorator.basicRun(TestDecorator.java:24)
      at junit.extensions.TestSetup$1.protect(TestSetup.java:21)
      at junit.extensions.TestSetup.run(TestSetup.java:25)
      at org.apache.derbyTesting.junit.BaseTestSetup.run(BaseTestSetup.java:57)
      at junit.extensions.TestDecorator.basicRun(TestDecorator.java:24)
      at junit.extensions.TestSetup$1.protect(TestSetup.java:21)
      at junit.extensions.TestSetup.run(TestSetup.java:25)
      at org.apache.derbyTesting.junit.BaseTestSetup.run(BaseTestSetup.java:57)
      at junit.extensions.TestDecorator.basicRun(TestDecorator.java:24)
      at junit.extensions.TestSetup$1.protect(TestSetup.java:21)
      at junit.extensions.TestSetup.run(TestSetup.java:25)
      at junit.extensions.TestDecorator.basicRun(TestDecorator.java:24)
      at junit.extensions.TestSetup$1.protect(TestSetup.java:21)
      at junit.extensions.TestSetup.run(TestSetup.java:25)
      at org.apache.derbyTesting.junit.BaseTestSetup.run(BaseTestSetup.java:57)
      at junit.extensions.TestDecorator.basicRun(TestDecorator.java:24)
      at junit.extensions.TestSetup$1.protect(TestSetup.java:21)
      at junit.extensions.TestSetup.run(TestSetup.java:25)
      Caused by: ERROR 25502: An SQL data change is not permitted for a read-only connection, user or database.
      at org.apache.derby.iapi.error.StandardException.newException(Unknown Source)
      at org.apache.derby.impl.sql.conn.GenericAuthorizer.authorize(Unknown Source)
      at org.apache.derby.exe.ac41588035x0136x48dfx14d0xffffe50a37560.g0(Unknown Source)
      at sun.reflect.NativeMethodAccessorImpl.invoke0(Native Method)
      at sun.reflect.NativeMethodAccessorImpl.invoke(NativeMethodAccessorImpl.java:79)
      at sun.reflect.DelegatingMethodAccessorImpl.invoke(DelegatingMethodAccessorImpl.java:43)
      at org.apache.derby.impl.services.reflect.ReflectMethod.invoke(Unknown Source)
      at org.apache.derby.impl.sql.execute.CallStatementResultSet.open(Unknown Source)
      at org.apache.derby.impl.sql.GenericPreparedStatement.executeStmt(Unknown Source)
      at org.apache.derby.impl.sql.GenericPreparedStatement.execute(Unknown Source)
      ... 57 more
      2) testUserFunctions(org.apache.derbyTesting.functionTests.tests.jdbcapi.XADSAuthenticationTest)java.sql.SQLException: An SQL data change is not permitted for a read-only connection, user or database.
      at org.apache.derby.impl.jdbc.SQLExceptionFactory.getSQLException(Unknown Source)
      at org.apache.derby.impl.jdbc.Util.generateCsSQLException(Unknown Source)
      at org.apache.derby.impl.jdbc.TransactionResourceImpl.wrapInSQLException(Unknown Source)
      at org.apache.derby.impl.jdbc.TransactionResourceImpl.handleException(Unknown Source)
      at org.apache.derby.impl.jdbc.EmbedConnection.handleException(Unknown Source)
      at org.apache.derby.impl.jdbc.ConnectionChild.handleException(Unknown Source)
      at org.apache.derby.impl.jdbc.EmbedStatement.executeStatement(Unknown Source)
      at org.apache.derby.impl.jdbc.EmbedPreparedStatement.executeStatement(Unknown Source)
      at org.apache.derby.impl.jdbc.EmbedCallableStatement.executeStatement(Unknown Source)
      at org.apache.derby.impl.jdbc.EmbedPreparedStatement.executeUpdate(Unknown Source)
      at org.apache.derbyTesting.junit.DatabasePropertyTestSetup.tearDown(DatabasePropertyTestSetup.java:294)
      at junit.extensions.TestSetup$1.protect(TestSetup.java:22)
      at junit.extensions.TestSetup.run(TestSetup.java:25)
      at org.apache.derbyTesting.junit.BaseTestSetup.run(BaseTestSetup.java:57)
      at junit.extensions.TestDecorator.basicRun(TestDecorator.java:24)
      at junit.extensions.TestSetup$1.protect(TestSetup.java:21)
      at junit.extensions.TestSetup.run(TestSetup.java:25)
      at junit.extensions.TestDecorator.basicRun(TestDecorator.java:24)
      at junit.extensions.TestSetup$1.protect(TestSetup.java:21)
      at junit.extensions.TestSetup.run(TestSetup.java:25)
      at org.apache.derbyTesting.junit.BaseTestSetup.run(BaseTestSetup.java:57)
      at junit.extensions.TestDecorator.basicRun(TestDecorator.java:24)
      at junit.extensions.TestSetup$1.protect(TestSetup.java:21)
      at junit.extensions.TestSetup.run(TestSetup.java:25)
      at org.apache.derbyTesting.junit.BaseTestSetup.run(BaseTestSetup.java:57)
      at junit.extensions.TestDecorator.basicRun(TestDecorator.java:24)
      at junit.extensions.TestSetup$1.protect(TestSetup.java:21)
      at junit.extensions.TestSetup.run(TestSetup.java:25)
      at junit.extensions.TestDecorator.basicRun(TestDecorator.java:24)
      at junit.extensions.TestSetup$1.protect(TestSetup.java:21)
      at junit.extensions.TestSetup.run(TestSetup.java:25)
      at org.apache.derbyTesting.junit.BaseTestSetup.run(BaseTestSetup.java:57)
      at junit.extensions.TestDecorator.basicRun(TestDecorator.java:24)
      at junit.extensions.TestSetup$1.protect(TestSetup.java:21)
      at junit.extensions.TestSetup.run(TestSetup.java:25)
      Caused by: ERROR 25502: An SQL data change is not permitted for a read-only connection, user or database.
      at org.apache.derby.iapi.error.StandardException.newException(Unknown Source)
      at org.apache.derby.impl.sql.conn.GenericAuthorizer.authorize(Unknown Source)
      at org.apache.derby.exe.acb9810038x0136x48dfx14d0xffffe50a37560.g0(Unknown Source)
      at sun.reflect.NativeMethodAccessorImpl.invoke0(Native Method)
      at sun.reflect.NativeMethodAccessorImpl.invoke(NativeMethodAccessorImpl.java:79)
      at sun.reflect.DelegatingMethodAccessorImpl.invoke(DelegatingMethodAccessorImpl.java:43)
      at <unknown class>.<unknown method>(Unknown Source)
      at org.apache.derby.impl.sql.execute.CallStatementResultSet.open(Unknown Source)
      at org.apache.derby.impl.sql.GenericPreparedStatement.executeStmt(Unknown Source)
      at org.apache.derby.impl.sql.GenericPreparedStatement.execute(Unknown Source)
      ... 49 more
      3) testUserFunctions(org.apache.derbyTesting.functionTests.tests.jdbcapi.XADSAuthenticationTest)java.sql.SQLException: Connection authentication failure occurred. Reason: Invalid authentication..
      at org.apache.derby.impl.jdbc.SQLExceptionFactory.getSQLException(Unknown Source)
      at org.apache.derby.impl.jdbc.Util.newEmbedSQLException(Unknown Source)
      at org.apache.derby.impl.jdbc.Util.newEmbedSQLException(Unknown Source)
      at org.apache.derby.impl.jdbc.Util.generateCsSQLException(Unknown Source)
      at org.apache.derby.impl.jdbc.EmbedConnection.newSQLException(Unknown Source)
      at org.apache.derby.impl.jdbc.EmbedConnection.checkUserCredentials(Unknown Source)
      at org.apache.derby.impl.jdbc.EmbedConnection.<init>(Unknown Source)
      at org.apache.derby.jdbc.Driver30.getNewEmbedConnection(Unknown Source)
      at org.apache.derby.jdbc.InternalDriver.connect(Unknown Source)
      at org.apache.derby.jdbc.AutoloadedDriver.connect(Unknown Source)
      at java.sql.DriverManager.getConnection(DriverManager.java:572)
      at java.sql.DriverManager.getConnection(DriverManager.java:165)
      at org.apache.derbyTesting.junit.DriverManagerConnector.openConnection(DriverManagerConnector.java:100)
      at org.apache.derbyTesting.junit.DriverManagerConnector.openConnection(DriverManagerConnector.java:67)
      at org.apache.derbyTesting.junit.DriverManagerConnector.openConnection(DriverManagerConnector.java:43)
      at org.apache.derbyTesting.junit.TestConfiguration.openDefaultConnection(TestConfiguration.java:1633)
      at org.apache.derbyTesting.junit.BaseJDBCTestSetup.getConnection(BaseJDBCTestSetup.java:72)
      at org.apache.derbyTesting.junit.DatabasePropertyTestSetup.tearDown(DatabasePropertyTestSetup.java:280)
      at junit.extensions.TestSetup$1.protect(TestSetup.java:22)
      at junit.extensions.TestSetup.run(TestSetup.java:25)
      at org.apache.derbyTesting.junit.BaseTestSetup.run(BaseTestSetup.java:57)
      at junit.extensions.TestDecorator.basicRun(TestDecorator.java:24)
      at junit.extensions.TestSetup$1.protect(TestSetup.java:21)
      at junit.extensions.TestSetup.run(TestSetup.java:25)
      at org.apache.derbyTesting.junit.BaseTestSetup.run(BaseTestSetup.java:57)
      at junit.extensions.TestDecorator.basicRun(TestDecorator.java:24)
      at junit.extensions.TestSetup$1.protect(TestSetup.java:21)
      at junit.extensions.TestSetup.run(TestSetup.java:25)
      at junit.extensions.TestDecorator.basicRun(TestDecorator.java:24)
      at junit.extensions.TestSetup$1.protect(TestSetup.java:21)
      at junit.extensions.TestSetup.run(TestSetup.java:25)
      at org.apache.derbyTesting.junit.BaseTestSetup.run(BaseTestSetup.java:57)
      at junit.extensions.TestDecorator.basicRun(TestDecorator.java:24)
      at junit.extensions.TestSetup$1.protect(TestSetup.java:21)
      at junit.extensions.TestSetup.run(TestSetup.java:25)
      4) testUserFunctions(org.apache.derbyTesting.functionTests.tests.jdbcapi.XADSAuthenticationTest)java.sql.SQLException: Connection authentication failure occurred. Reason: Invalid authentication..
      at org.apache.derby.impl.jdbc.SQLExceptionFactory.getSQLException(Unknown Source)
      at org.apache.derby.impl.jdbc.Util.newEmbedSQLException(Unknown Source)
      at org.apache.derby.impl.jdbc.Util.newEmbedSQLException(Unknown Source)
      at org.apache.derby.impl.jdbc.Util.generateCsSQLException(Unknown Source)
      at org.apache.derby.impl.jdbc.EmbedConnection.newSQLException(Unknown Source)
      at org.apache.derby.impl.jdbc.EmbedConnection.checkUserCredentials(Unknown Source)
      at org.apache.derby.impl.jdbc.EmbedConnection.<init>(Unknown Source)
      at org.apache.derby.jdbc.Driver30.getNewEmbedConnection(Unknown Source)
      at org.apache.derby.jdbc.InternalDriver.connect(Unknown Source)
      at org.apache.derby.jdbc.AutoloadedDriver.connect(Unknown Source)
      at java.sql.DriverManager.getConnection(DriverManager.java:572)
      at java.sql.DriverManager.getConnection(DriverManager.java:165)
      at org.apache.derbyTesting.junit.DriverManagerConnector.openConnection(DriverManagerConnector.java:100)
      at org.apache.derbyTesting.junit.DriverManagerConnector.openConnection(DriverManagerConnector.java:67)
      at org.apache.derbyTesting.junit.DriverManagerConnector.openConnection(DriverManagerConnector.java:43)
      at org.apache.derbyTesting.junit.TestConfiguration.openDefaultConnection(TestConfiguration.java:1633)
      at org.apache.derbyTesting.junit.BaseJDBCTestSetup.getConnection(BaseJDBCTestSetup.java:72)
      at org.apache.derbyTesting.junit.DatabasePropertyTestSetup.tearDown(DatabasePropertyTestSetup.java:280)
      at junit.extensions.TestSetup$1.protect(TestSetup.java:22)
      at junit.extensions.TestSetup.run(TestSetup.java:25)
      at org.apache.derbyTesting.junit.BaseTestSetup.run(BaseTestSetup.java:57)
      at junit.extensions.TestDecorator.basicRun(TestDecorator.java:24)
      at junit.extensions.TestSetup$1.protect(TestSetup.java:21)
      at junit.extensions.TestSetup.run(TestSetup.java:25)
      at junit.extensions.TestDecorator.basicRun(TestDecorator.java:24)
      at junit.extensions.TestSetup$1.protect(TestSetup.java:21)
      at junit.extensions.TestSetup.run(TestSetup.java:25)
      at org.apache.derbyTesting.junit.BaseTestSetup.run(BaseTestSetup.java:57)
      at junit.extensions.TestDecorator.basicRun(TestDecorator.java:24)
      at junit.extensions.TestSetup$1.protect(TestSetup.java:21)
      at junit.extensions.TestSetup.run(TestSetup.java:25)
      5) testNotFullAccessUsers(org.apache.derbyTesting.functionTests.tests.jdbcapi.XADSAuthenticationTest)java.sql.SQLException: Connection authentication failure occurred. Reason: Invalid authentication..
      at org.apache.derby.impl.jdbc.SQLExceptionFactory.getSQLException(Unknown Source)
      at org.apache.derby.impl.jdbc.Util.newEmbedSQLException(Unknown Source)
      at org.apache.derby.impl.jdbc.Util.newEmbedSQLException(Unknown Source)
      at org.apache.derby.impl.jdbc.Util.generateCsSQLException(Unknown Source)
      at org.apache.derby.impl.jdbc.EmbedConnection.newSQLException(Unknown Source)
      at org.apache.derby.impl.jdbc.EmbedConnection.checkUserCredentials(Unknown Source)
      at org.apache.derby.impl.jdbc.EmbedConnection.<init>(Unknown Source)
      at org.apache.derby.jdbc.Driver30.getNewEmbedConnection(Unknown Source)
      at org.apache.derby.jdbc.InternalDriver.connect(Unknown Source)
      at org.apache.derby.jdbc.AutoloadedDriver.connect(Unknown Source)
      at java.sql.DriverManager.getConnection(DriverManager.java:572)
      at java.sql.DriverManager.getConnection(DriverManager.java:165)
      at org.apache.derbyTesting.junit.DriverManagerConnector.openConnection(DriverManagerConnector.java:100)
      at org.apache.derbyTesting.junit.DriverManagerConnector.openConnection(DriverManagerConnector.java:67)
      at org.apache.derbyTesting.junit.DriverManagerConnector.openConnection(DriverManagerConnector.java:43)
      at org.apache.derbyTesting.junit.TestConfiguration.openDefaultConnection(TestConfiguration.java:1633)
      at org.apache.derbyTesting.junit.BaseJDBCTestSetup.getConnection(BaseJDBCTestSetup.java:72)
      at org.apache.derbyTesting.junit.DatabasePropertyTestSetup.setProperties(DatabasePropertyTestSetup.java:313)
      at org.apache.derbyTesting.junit.DatabasePropertyTestSetup.setUp(DatabasePropertyTestSetup.java:268)
      at junit.extensions.TestSetup$1.protect(TestSetup.java:20)
      at junit.extensions.TestSetup.run(TestSetup.java:25)
      at org.apache.derbyTesting.junit.BaseTestSetup.run(BaseTestSetup.java:57)
      at junit.extensions.TestDecorator.basicRun(TestDecorator.java:24)
      at junit.extensions.TestSetup$1.protect(TestSetup.java:21)
      at junit.extensions.TestSetup.run(TestSetup.java:25)
      at junit.extensions.TestDecorator.basicRun(TestDecorator.java:24)
      at junit.extensions.TestSetup$1.protect(TestSetup.java:21)
      at junit.extensions.TestSetup.run(TestSetup.java:25)
      at org.apache.derbyTesting.junit.BaseTestSetup.run(BaseTestSetup.java:57)
      at junit.extensions.TestDecorator.basicRun(TestDecorator.java:24)
      at junit.extensions.TestSetup$1.protect(TestSetup.java:21)
      at junit.extensions.TestSetup.run(TestSetup.java:25)
      6) testChangePasswordAndDatabasePropertiesOnly(org.apache.derbyTesting.functionTests.tests.jdbcapi.XADSAuthenticationTest)java.sql.SQLException: Connection authentication failure occurred. Reason: Invalid authentication..
      at org.apache.derby.impl.jdbc.SQLExceptionFactory.getSQLException(Unknown Source)
      at org.apache.derby.impl.jdbc.Util.newEmbedSQLException(Unknown Source)
      at org.apache.derby.impl.jdbc.Util.newEmbedSQLException(Unknown Source)
      at org.apache.derby.impl.jdbc.Util.generateCsSQLException(Unknown Source)
      at org.apache.derby.impl.jdbc.EmbedConnection.newSQLException(Unknown Source)
      at org.apache.derby.impl.jdbc.EmbedConnection.checkUserCredentials(Unknown Source)
      at org.apache.derby.impl.jdbc.EmbedConnection.<init>(Unknown Source)
      at org.apache.derby.jdbc.Driver30.getNewEmbedConnection(Unknown Source)
      at org.apache.derby.jdbc.InternalDriver.connect(Unknown Source)
      at org.apache.derby.jdbc.AutoloadedDriver.connect(Unknown Source)
      at java.sql.DriverManager.getConnection(DriverManager.java:572)
      at java.sql.DriverManager.getConnection(DriverManager.java:165)
      at org.apache.derbyTesting.junit.DriverManagerConnector.openConnection(DriverManagerConnector.java:100)
      at org.apache.derbyTesting.junit.DriverManagerConnector.openConnection(DriverManagerConnector.java:67)
      at org.apache.derbyTesting.junit.DriverManagerConnector.openConnection(DriverManagerConnector.java:43)
      at org.apache.derbyTesting.junit.TestConfiguration.openDefaultConnection(TestConfiguration.java:1633)
      at org.apache.derbyTesting.junit.BaseJDBCTestSetup.getConnection(BaseJDBCTestSetup.java:72)
      at org.apache.derbyTesting.junit.DatabasePropertyTestSetup.setProperties(DatabasePropertyTestSetup.java:313)
      at org.apache.derbyTesting.junit.DatabasePropertyTestSetup.setUp(DatabasePropertyTestSetup.java:268)
      at junit.extensions.TestSetup$1.protect(TestSetup.java:20)
      at junit.extensions.TestSetup.run(TestSetup.java:25)
      at org.apache.derbyTesting.junit.BaseTestSetup.run(BaseTestSetup.java:57)
      at junit.extensions.TestDecorator.basicRun(TestDecorator.java:24)
      at junit.extensions.TestSetup$1.protect(TestSetup.java:21)
      at junit.extensions.TestSetup.run(TestSetup.java:25)
      at junit.extensions.TestDecorator.basicRun(TestDecorator.java:24)
      at junit.extensions.TestSetup$1.protect(TestSetup.java:21)
      at junit.extensions.TestSetup.run(TestSetup.java:25)
      at org.apache.derbyTesting.junit.BaseTestSetup.run(BaseTestSetup.java:57)
      at junit.extensions.TestDecorator.basicRun(TestDecorator.java:24)
      at junit.extensions.TestSetup$1.protect(TestSetup.java:21)
      at junit.extensions.TestSetup.run(TestSetup.java:25)
      7) testGreekCharacters(org.apache.derbyTesting.functionTests.tests.jdbcapi.XADSAuthenticationTest)java.sql.SQLException: Connection authentication failure occurred. Reason: Invalid authentication..
      at org.apache.derby.impl.jdbc.SQLExceptionFactory.getSQLException(Unknown Source)
      at org.apache.derby.impl.jdbc.Util.newEmbedSQLException(Unknown Source)
      at org.apache.derby.impl.jdbc.Util.newEmbedSQLException(Unknown Source)
      at org.apache.derby.impl.jdbc.Util.generateCsSQLException(Unknown Source)
      at org.apache.derby.impl.jdbc.EmbedConnection.newSQLException(Unknown Source)
      at org.apache.derby.impl.jdbc.EmbedConnection.checkUserCredentials(Unknown Source)
      at org.apache.derby.impl.jdbc.EmbedConnection.<init>(Unknown Source)
      at org.apache.derby.jdbc.Driver30.getNewEmbedConnection(Unknown Source)
      at org.apache.derby.jdbc.InternalDriver.connect(Unknown Source)
      at org.apache.derby.jdbc.AutoloadedDriver.connect(Unknown Source)
      at java.sql.DriverManager.getConnection(DriverManager.java:572)
      at java.sql.DriverManager.getConnection(DriverManager.java:165)
      at org.apache.derbyTesting.junit.DriverManagerConnector.openConnection(DriverManagerConnector.java:100)
      at org.apache.derbyTesting.junit.DriverManagerConnector.openConnection(DriverManagerConnector.java:67)
      at org.apache.derbyTesting.junit.DriverManagerConnector.openConnection(DriverManagerConnector.java:43)
      at org.apache.derbyTesting.junit.TestConfiguration.openDefaultConnection(TestConfiguration.java:1633)
      at org.apache.derbyTesting.junit.BaseJDBCTestSetup.getConnection(BaseJDBCTestSetup.java:72)
      at org.apache.derbyTesting.junit.DatabasePropertyTestSetup.setProperties(DatabasePropertyTestSetup.java:313)
      at org.apache.derbyTesting.junit.DatabasePropertyTestSetup.setUp(DatabasePropertyTestSetup.java:268)
      at junit.extensions.TestSetup$1.protect(TestSetup.java:20)
      at junit.extensions.TestSetup.run(TestSetup.java:25)
      at org.apache.derbyTesting.junit.BaseTestSetup.run(BaseTestSetup.java:57)
      at junit.extensions.TestDecorator.basicRun(TestDecorator.java:24)
      at junit.extensions.TestSetup$1.protect(TestSetup.java:21)
      at junit.extensions.TestSetup.run(TestSetup.java:25)
      at junit.extensions.TestDecorator.basicRun(TestDecorator.java:24)
      at junit.extensions.TestSetup$1.protect(TestSetup.java:21)
      at junit.extensions.TestSetup.run(TestSetup.java:25)
      at org.apache.derbyTesting.junit.BaseTestSetup.run(BaseTestSetup.java:57)
      at junit.extensions.TestDecorator.basicRun(TestDecorator.java:24)
      at junit.extensions.TestSetup$1.protect(TestSetup.java:21)
      at junit.extensions.TestSetup.run(TestSetup.java:25)
      8) testSystemShutdown(org.apache.derbyTesting.functionTests.tests.jdbcapi.XADSAuthenticationTest)java.sql.SQLException: Connection authentication failure occurred. Reason: Invalid authentication..
      at org.apache.derby.impl.jdbc.SQLExceptionFactory.getSQLException(Unknown Source)
      at org.apache.derby.impl.jdbc.Util.newEmbedSQLException(Unknown Source)
      at org.apache.derby.impl.jdbc.Util.newEmbedSQLException(Unknown Source)
      at org.apache.derby.impl.jdbc.Util.generateCsSQLException(Unknown Source)
      at org.apache.derby.impl.jdbc.EmbedConnection.newSQLException(Unknown Source)
      at org.apache.derby.impl.jdbc.EmbedConnection.checkUserCredentials(Unknown Source)
      at org.apache.derby.impl.jdbc.EmbedConnection.<init>(Unknown Source)
      at org.apache.derby.jdbc.Driver30.getNewEmbedConnection(Unknown Source)
      at org.apache.derby.jdbc.InternalDriver.connect(Unknown Source)
      at org.apache.derby.jdbc.AutoloadedDriver.connect(Unknown Source)
      at java.sql.DriverManager.getConnection(DriverManager.java:572)
      at java.sql.DriverManager.getConnection(DriverManager.java:165)
      at org.apache.derbyTesting.junit.DriverManagerConnector.openConnection(DriverManagerConnector.java:100)
      at org.apache.derbyTesting.junit.DriverManagerConnector.openConnection(DriverManagerConnector.java:67)
      at org.apache.derbyTesting.junit.DriverManagerConnector.openConnection(DriverManagerConnector.java:43)
      at org.apache.derbyTesting.junit.TestConfiguration.openDefaultConnection(TestConfiguration.java:1633)
      at org.apache.derbyTesting.junit.BaseJDBCTestSetup.getConnection(BaseJDBCTestSetup.java:72)
      at org.apache.derbyTesting.junit.DatabasePropertyTestSetup.setProperties(DatabasePropertyTestSetup.java:313)
      at org.apache.derbyTesting.junit.DatabasePropertyTestSetup.setUp(DatabasePropertyTestSetup.java:268)
      at junit.extensions.TestSetup$1.protect(TestSetup.java:20)
      at junit.extensions.TestSetup.run(TestSetup.java:25)
      at org.apache.derbyTesting.junit.BaseTestSetup.run(BaseTestSetup.java:57)
      at junit.extensions.TestDecorator.basicRun(TestDecorator.java:24)
      at junit.extensions.TestSetup$1.protect(TestSetup.java:21)
      at junit.extensions.TestSetup.run(TestSetup.java:25)
      at junit.extensions.TestDecorator.basicRun(TestDecorator.java:24)
      at junit.extensions.TestSetup$1.protect(TestSetup.java:21)
      at junit.extensions.TestSetup.run(TestSetup.java:25)
      at org.apache.derbyTesting.junit.BaseTestSetup.run(BaseTestSetup.java:57)
      at junit.extensions.TestDecorator.basicRun(TestDecorator.java:24)
      at junit.extensions.TestSetup$1.protect(TestSetup.java:21)
      at junit.extensions.TestSetup.run(TestSetup.java:25)
      There was 1 failure:
      1) XADSAuthenticationTestjunit.framework.AssertionFailedError: Failed to delete 14 files (root=D:\jartest\JarResults.2012-03-24\ibm15_suites.All\system\singleUse\oneused8): D:\jartest\JarResults.2012-03-24\ibm15_suites.All\system\singleUse\oneused8\seg0\c10.dat (isDir=false, canRead=true, canWrite=true, size=12288), D:\jartest\JarResults.2012-03-24\ibm15_suites.All\system\singleUse\oneused8\seg0\c180.dat (isDir=false, canRead=true, canWrite=true, size=36864), D:\jartest\JarResults.2012-03-24\ibm15_suites.All\system\singleUse\oneused8\seg0\c191.dat (isDir=false, canRead=true, canWrite=true, size=16384), D:\jartest\JarResults.2012-03-24\ibm15_suites.All\system\singleUse\oneused8\seg0\c20.dat (isDir=false, canRead=true, canWrite=true, size=28672), D:\jartest\JarResults.2012-03-24\ibm15_suites.All\system\singleUse\oneused8\seg0\c51.dat (isDir=false, canRead=true, canWrite=true, size=8192), D:\jartest\JarResults.2012-03-24\ibm15_suites.All\system\singleUse\oneused8\seg0\c60.dat (isDir=false, canRead=true, canWrite=true, size=8192), D:\jartest\JarResults.2012-03-24\ibm15_suites.All\system\singleUse\oneused8\seg0\c71.dat (isDir=false, canRead=true, canWrite=true, size=8192), D:\jartest\JarResults.2012-03-24\ibm15_suites.All\system\singleUse\oneused8\seg0\c90.dat (isDir=false, canRead=true, canWrite=true, size=20480), D:\jartest\JarResults.2012-03-24\ibm15_suites.All\system\singleUse\oneused8\seg0\ca1.dat (isDir=false, canRead=true, canWrite=true, size=24576), D:\jartest\JarResults.2012-03-24\ibm15_suites.All\system\singleUse\oneused8\seg0\cc0.dat (isDir=false, canRead=true, canWrite=true, size=8192), D:\jartest\JarResults.2012-03-24\ibm15_suites.All\system\singleUse\oneused8\seg0\cd1.dat (isDir=false, canRead=true, canWrite=true, size=8192), D:\jartest\JarResults.2012-03-24\ibm15_suites.All\system\singleUse\oneused8\seg0\ce1.dat (isDir=false, canRead=true, canWrite=true, size=8192), D:\jartest\JarResults.2012-03-24\ibm15_suites.All\system\singleUse\oneused8\seg0 (isDir=true, canRead=true, canWrite=true, size=0), D:\jartest\JarResults.2012-03-24\ibm15_suites.All\system\singleUse\oneused8 (isDir=true, canRead=true, canWrite=true, size=0)
      at org.apache.derbyTesting.junit.BaseJDBCTestCase.assertDirectoryDeleted(BaseJDBCTestCase.java:1491)
      at org.apache.derbyTesting.junit.DropDatabaseSetup.removeDir(DropDatabaseSetup.java:120)
      at org.apache.derbyTesting.junit.DropDatabaseSetup.access$000(DropDatabaseSetup.java:35)
      at org.apache.derbyTesting.junit.DropDatabaseSetup$1.run(DropDatabaseSetup.java:106)
      at java.security.AccessController.doPrivileged(AccessController.java:192)
      at org.apache.derbyTesting.junit.DropDatabaseSetup.removeDirectory(DropDatabaseSetup.java:103)
      at org.apache.derbyTesting.junit.DropDatabaseSetup.removeDirectory(DropDatabaseSetup.java:99)
      at org.apache.derbyTesting.junit.DropDatabaseSetup.removeDatabase(DropDatabaseSetup.java:92)
      at org.apache.derbyTesting.junit.DropDatabaseSetup.tearDown(DropDatabaseSetup.java:78)
      at junit.extensions.TestSetup$1.protect(TestSetup.java:22)
      at junit.extensions.TestSetup.run(TestSetup.java:25)
      at org.apache.derbyTesting.junit.BaseTestSetup.run(BaseTestSetup.java:57)
      at junit.extensions.TestDecorator.basicRun(TestDecorator.java:24)
      at junit.extensions.TestSetup$1.protect(TestSetup.java:21)
      at junit.extensions.TestSetup.run(TestSetup.java:25)

      FAILURES!!!
      Tests run: 13606, Failures: 1, Errors: 8

        Issue Links

          Activity

          There are no comments yet on this issue.

            People

            • Assignee:
              Unassigned
              Reporter:
              Kathey Marsden
            • Votes:
              0 Vote for this issue
              Watchers:
              0 Start watching this issue

              Dates

              • Created:
                Updated:
                Resolved:

                Development