Uploaded image for project: 'Derby'
  1. Derby
  2. DERBY-5575

testImportExportProcedures(org.apache.derbyTesting.functionTests.tests.tools.ImportExportProcedureTest)java.sql.SQLException: An IOException occurred while writing data to the file.

    XMLWordPrintableJSON

    Details

    • Type: Bug
    • Status: Closed
    • Priority: Major
    • Resolution: Cannot Reproduce
    • Affects Version/s: 10.9.1.0
    • Fix Version/s: None
    • Component/s: Test
    • Urgency:
      Normal
    • Bug behavior facts:
      Regression Test Failure

      Description

      failed in nightly regression test suite, trunk, ibm17, windows

      http://people.apache.org/~myrnavl/derby_test_results/main/windows/testlog/ibm17/1233150-suites.All_diff.txt

      1) testImportExportProcedures(org.apache.derbyTesting.functionTests.tests.tools.ImportExportProcedureTest)java.sql.SQLException: An IOException occurred while writing data to the file.
      at org.apache.derby.client.am.SQLExceptionFactory40.getSQLException(Unknown Source)
      at org.apache.derby.client.am.SqlException.getSQLException(Unknown Source)
      at org.apache.derby.client.am.PreparedStatement.executeUpdate(Unknown Source)
      at org.apache.derbyTesting.junit.BaseJDBCTestCase.assertUpdateCount(BaseJDBCTestCase.java:1230)
      at org.apache.derbyTesting.functionTests.tests.tools.ImportExportProcedureTest.testImportExportProcedures(ImportExportProcedureTest.java:842)
      at sun.reflect.NativeMethodAccessorImpl.invoke0(Native Method)
      at sun.reflect.NativeMethodAccessorImpl.invoke(NativeMethodAccessorImpl.java:88)
      at sun.reflect.DelegatingMethodAccessorImpl.invoke(DelegatingMethodAccessorImpl.java:55)
      at org.apache.derbyTesting.junit.BaseTestCase.runBare(BaseTestCase.java:116)
      at junit.extensions.TestDecorator.basicRun(TestDecorator.java:24)
      at junit.extensions.TestSetup$1.protect(TestSetup.java:21)
      at junit.extensions.TestSetup.run(TestSetup.java:25)
      at org.apache.derbyTesting.junit.BaseTestSetup.run(BaseTestSetup.java:57)
      at junit.extensions.TestDecorator.basicRun(TestDecorator.java:24)
      at junit.extensions.TestSetup$1.protect(TestSetup.java:21)
      at junit.extensions.TestSetup.run(TestSetup.java:25)
      at junit.extensions.TestDecorator.basicRun(TestDecorator.java:24)
      at junit.extensions.TestSetup$1.protect(TestSetup.java:21)
      at junit.extensions.TestSetup.run(TestSetup.java:25)
      at org.apache.derbyTesting.junit.BaseTestSetup.run(BaseTestSetup.java:57)
      at junit.extensions.TestDecorator.basicRun(TestDecorator.java:24)
      at junit.extensions.TestSetup$1.protect(TestSetup.java:21)
      at junit.extensions.TestSetup.run(TestSetup.java:25)
      Caused by: org.apache.derby.client.am.SqlException: An IOException occurred while writing data to the file.
      at org.apache.derby.client.am.Statement.completeExecute(Unknown Source)
      at org.apache.derby.client.net.NetStatementReply.parseEXCSQLSTTreply(Unknown Source)
      at org.apache.derby.client.net.NetStatementReply.readExecuteCall(Unknown Source)
      at org.apache.derby.client.net.StatementReply.readExecuteCall(Unknown Source)
      at org.apache.derby.client.net.NetStatement.readExecuteCall_(Unknown Source)
      at org.apache.derby.client.am.Statement.readExecuteCall(Unknown Source)
      at org.apache.derby.client.am.PreparedStatement.flowExecute(Unknown Source)
      at org.apache.derby.client.am.PreparedStatement.executeUpdateX(Unknown Source)
      ... 47 more
      Caused by: org.apache.derby.client.am.SqlException: Java exception: 'extinout\t1.del (Access is denied.): java.io.FileNotFoundException'.
      at org.apache.derby.client.am.SqlException.<init>(Unknown Source)
      at org.apache.derby.client.am.SqlException.<init>(Unknown Source)
      ... 55 more

      FAILURES!!!
      Tests run: 15252, Failures: 0, Errors: 1

        Attachments

        1. derby.log
          1.21 MB
          Mike Matrigali

          Issue Links

            Activity

              People

              • Assignee:
                Unassigned
                Reporter:
                mikem Mike Matrigali
              • Votes:
                0 Vote for this issue
                Watchers:
                1 Start watching this issue

                Dates

                • Created:
                  Updated:
                  Resolved: