Derby
  1. Derby
  2. DERBY-5572

multiple errors in nightly tests during DriverMgrAuthenticationTest test. reason: Connection authentication failure occurred. Reason: userid or password invalid.

    Details

    • Type: Bug Bug
    • Status: Closed
    • Priority: Major Major
    • Resolution: Duplicate
    • Affects Version/s: 10.9.1.0
    • Fix Version/s: None
    • Component/s: Test
    • Labels:
      None
    • Environment:
    • Bug behavior facts:
      Regression Test Failure

      Description

      nightly runs against trunk on windows using jdk16 failed 2 nights in a row with errors in DriverMgrAuthenticationTest, reason: Connection authentication failure occurred. Reason: userid or password invalid. Both nights tests passed against all other jvm's.

      This run got 10 errors with connection refused on many of them, will inline errors in separate comment:
      http://people.apache.org/~myrnavl/derby_test_results/main/windows/testlog/ibm16/1230376-suites.All_diff.txt

      This run inbetween worked:
      http://people.apache.org/~myrnavl/derby_test_results/main/windows/testlog/ibm16/1231438-suites.All_diff.txt

      The following run got 7 errors - will inline errors in separate comment:
      http://people.apache.org/~myrnavl/derby_test_results/main/windows/testlog/ibm16/1232722-suites.All_diff.txt

        Issue Links

          Activity

          Hide
          Mike Matrigali added a comment -

          Errors from the following build:
          http://people.apache.org/~myrnavl/derby_test_results/main/windows/testlog/ibm16/1232722-suites.All_diff.txt
          1) testChangePasswordAndDatabasePropertiesOnly(org.apache.derbyTesting.functionTests.tests.jdbcapi.DriverMgrAuthenticationTest)java.sql.SQLException: An SQL data change is not permitted for a read-only connection, user or database.
          at org.apache.derby.client.am.SQLExceptionFactory40.getSQLException(Unknown Source)
          at org.apache.derby.client.am.SqlException.getSQLException(Unknown Source)
          at org.apache.derby.client.am.PreparedStatement.execute(Unknown Source)
          at org.apache.derbyTesting.functionTests.tests.jdbcapi.AuthenticationTest.setDatabaseProperty(AuthenticationTest.java:1297)
          at org.apache.derbyTesting.functionTests.tests.jdbcapi.AuthenticationTest.setUp(AuthenticationTest.java:192)
          at org.apache.derbyTesting.junit.BaseTestCase.runBare(BaseTestCase.java:116)
          at junit.extensions.TestDecorator.basicRun(TestDecorator.java:24)
          at junit.extensions.TestSetup$1.protect(TestSetup.java:21)
          at junit.extensions.TestSetup.run(TestSetup.java:18)
          at org.apache.derbyTesting.junit.BaseTestSetup.run(BaseTestSetup.java:57)
          at junit.extensions.TestDecorator.basicRun(TestDecorator.java:24)
          at junit.extensions.TestSetup$1.protect(TestSetup.java:21)
          at junit.extensions.TestSetup.run(TestSetup.java:18)
          at junit.extensions.TestDecorator.basicRun(TestDecorator.java:24)
          at junit.extensions.TestSetup$1.protect(TestSetup.java:21)
          at junit.extensions.TestSetup.run(TestSetup.java:18)
          at org.apache.derbyTesting.junit.BaseTestSetup.run(BaseTestSetup.java:57)
          at junit.extensions.TestDecorator.basicRun(TestDecorator.java:24)
          at junit.extensions.TestSetup$1.protect(TestSetup.java:21)
          at junit.extensions.TestSetup.run(TestSetup.java:18)
          at org.apache.derbyTesting.junit.BaseTestSetup.run(BaseTestSetup.java:57)
          at junit.extensions.TestDecorator.basicRun(TestDecorator.java:24)
          at junit.extensions.TestSetup$1.protect(TestSetup.java:21)
          at junit.extensions.TestSetup.run(TestSetup.java:18)
          at junit.extensions.TestDecorator.basicRun(TestDecorator.java:24)
          at junit.extensions.TestSetup$1.protect(TestSetup.java:21)
          at junit.extensions.TestSetup.run(TestSetup.java:18)
          at org.apache.derbyTesting.junit.BaseTestSetup.run(BaseTestSetup.java:57)
          at junit.extensions.TestDecorator.basicRun(TestDecorator.java:24)
          at junit.extensions.TestSetup$1.protect(TestSetup.java:21)
          at junit.extensions.TestSetup.run(TestSetup.java:18)
          at junit.extensions.TestDecorator.basicRun(TestDecorator.java:24)
          at junit.extensions.TestSetup$1.protect(TestSetup.java:21)
          at junit.extensions.TestSetup.run(TestSetup.java:18)
          at org.apache.derbyTesting.junit.BaseTestSetup.run(BaseTestSetup.java:57)
          at junit.extensions.TestDecorator.basicRun(TestDecorator.java:24)
          at junit.extensions.TestSetup$1.protect(TestSetup.java:21)
          at junit.extensions.TestSetup.run(TestSetup.java:18)
          Caused by: org.apache.derby.client.am.SqlException: An SQL data change is not permitted for a read-only connection, user or database.
          at org.apache.derby.client.am.Statement.completeExecute(Unknown Source)
          at org.apache.derby.client.net.NetStatementReply.parseEXCSQLSTTreply(Unknown Source)
          at org.apache.derby.client.net.NetStatementReply.readExecuteCall(Unknown Source)
          at org.apache.derby.client.net.StatementReply.readExecuteCall(Unknown Source)
          at org.apache.derby.client.net.NetStatement.readExecuteCall_(Unknown Source)
          at org.apache.derby.client.am.Statement.readExecuteCall(Unknown Source)
          at org.apache.derby.client.am.PreparedStatement.flowExecute(Unknown Source)
          at org.apache.derby.client.am.PreparedStatement.executeX(Unknown Source)
          ... 63 more
          2) testChangePasswordAndDatabasePropertiesOnly(org.apache.derbyTesting.functionTests.tests.jdbcapi.DriverMgrAuthenticationTest)java.sql.SQLException: An SQL data change is not permitted for a read-only connection, user or database.
          at org.apache.derby.client.am.SQLExceptionFactory40.getSQLException(Unknown Source)
          at org.apache.derby.client.am.SqlException.getSQLException(Unknown Source)
          at org.apache.derby.client.am.PreparedStatement.executeUpdate(Unknown Source)
          at org.apache.derbyTesting.junit.DatabasePropertyTestSetup.tearDown(DatabasePropertyTestSetup.java:294)
          at junit.extensions.TestSetup$1.protect(TestSetup.java:22)
          at junit.extensions.TestSetup.run(TestSetup.java:18)
          at org.apache.derbyTesting.junit.BaseTestSetup.run(BaseTestSetup.java:57)
          at junit.extensions.TestDecorator.basicRun(TestDecorator.java:24)
          at junit.extensions.TestSetup$1.protect(TestSetup.java:21)
          at junit.extensions.TestSetup.run(TestSetup.java:18)
          at junit.extensions.TestDecorator.basicRun(TestDecorator.java:24)
          at junit.extensions.TestSetup$1.protect(TestSetup.java:21)
          at junit.extensions.TestSetup.run(TestSetup.java:18)
          at org.apache.derbyTesting.junit.BaseTestSetup.run(BaseTestSetup.java:57)
          at junit.extensions.TestDecorator.basicRun(TestDecorator.java:24)
          at junit.extensions.TestSetup$1.protect(TestSetup.java:21)
          at junit.extensions.TestSetup.run(TestSetup.java:18)
          at org.apache.derbyTesting.junit.BaseTestSetup.run(BaseTestSetup.java:57)
          at junit.extensions.TestDecorator.basicRun(TestDecorator.java:24)
          at junit.extensions.TestSetup$1.protect(TestSetup.java:21)
          at junit.extensions.TestSetup.run(TestSetup.java:18)
          at junit.extensions.TestDecorator.basicRun(TestDecorator.java:24)
          at junit.extensions.TestSetup$1.protect(TestSetup.java:21)
          at junit.extensions.TestSetup.run(TestSetup.java:18)
          at org.apache.derbyTesting.junit.BaseTestSetup.run(BaseTestSetup.java:57)
          at junit.extensions.TestDecorator.basicRun(TestDecorator.java:24)
          at junit.extensions.TestSetup$1.protect(TestSetup.java:21)
          at junit.extensions.TestSetup.run(TestSetup.java:18)
          at junit.extensions.TestDecorator.basicRun(TestDecorator.java:24)
          at junit.extensions.TestSetup$1.protect(TestSetup.java:21)
          at junit.extensions.TestSetup.run(TestSetup.java:18)
          at org.apache.derbyTesting.junit.BaseTestSetup.run(BaseTestSetup.java:57)
          at junit.extensions.TestDecorator.basicRun(TestDecorator.java:24)
          at junit.extensions.TestSetup$1.protect(TestSetup.java:21)
          at junit.extensions.TestSetup.run(TestSetup.java:18)
          Caused by: org.apache.derby.client.am.SqlException: An SQL data change is not permitted for a read-only connection, user or database.
          at org.apache.derby.client.am.Statement.completeExecute(Unknown Source)
          at org.apache.derby.client.net.NetStatementReply.parseEXCSQLSTTreply(Unknown Source)
          at org.apache.derby.client.net.NetStatementReply.readExecuteCall(Unknown Source)
          at org.apache.derby.client.net.StatementReply.readExecuteCall(Unknown Source)
          at org.apache.derby.client.net.NetStatement.readExecuteCall_(Unknown Source)
          at org.apache.derby.client.am.Statement.readExecuteCall(Unknown Source)
          at org.apache.derby.client.am.PreparedStatement.flowExecute(Unknown Source)
          at org.apache.derby.client.am.PreparedStatement.executeUpdateX(Unknown Source)
          ... 55 more
          3) testChangePasswordAndDatabasePropertiesOnly(org.apache.derbyTesting.functionTests.tests.jdbcapi.DriverMgrAuthenticationTest)java.sql.SQLNonTransientConnectionException: Connection authentication failure occurred. Reason: userid or password invalid.
          at java.lang.Throwable.<init>(Throwable.java:67)
          at java.sql.SQLException.<init>(SQLException.java:101)
          at org.apache.derby.client.am.SQLExceptionFactory40.getSQLException(Unknown Source)
          at org.apache.derby.client.am.SqlException.getSQLException(Unknown Source)
          at org.apache.derby.jdbc.ClientDriver.connect(Unknown Source)
          at java.sql.DriverManager.getConnection(DriverManager.java:322)
          at java.sql.DriverManager.getConnection(DriverManager.java:297)
          at org.apache.derbyTesting.junit.DriverManagerConnector.openConnection(DriverManagerConnector.java:98)
          at org.apache.derbyTesting.junit.DriverManagerConnector.openConnection(DriverManagerConnector.java:43)
          at org.apache.derbyTesting.junit.TestConfiguration.openDefaultConnection(TestConfiguration.java:1574)
          at org.apache.derbyTesting.junit.BaseJDBCTestSetup.getConnection(BaseJDBCTestSetup.java:72)
          at org.apache.derbyTesting.junit.DatabasePropertyTestSetup.tearDown(DatabasePropertyTestSetup.java:288)
          at junit.extensions.TestSetup$1.protect(TestSetup.java:22)
          at junit.extensions.TestSetup.run(TestSetup.java:18)
          at org.apache.derbyTesting.junit.BaseTestSetup.run(BaseTestSetup.java:57)
          at junit.extensions.TestDecorator.basicRun(TestDecorator.java:24)
          at junit.extensions.TestSetup$1.protect(TestSetup.java:21)
          at junit.extensions.TestSetup.run(TestSetup.java:18)
          at org.apache.derbyTesting.junit.BaseTestSetup.run(BaseTestSetup.java:57)
          at junit.extensions.TestDecorator.basicRun(TestDecorator.java:24)
          at junit.extensions.TestSetup$1.protect(TestSetup.java:21)
          at junit.extensions.TestSetup.run(TestSetup.java:18)
          at junit.extensions.TestDecorator.basicRun(TestDecorator.java:24)
          at junit.extensions.TestSetup$1.protect(TestSetup.java:21)
          at junit.extensions.TestSetup.run(TestSetup.java:18)
          at org.apache.derbyTesting.junit.BaseTestSetup.run(BaseTestSetup.java:57)
          at junit.extensions.TestDecorator.basicRun(TestDecorator.java:24)
          at junit.extensions.TestSetup$1.protect(TestSetup.java:21)
          at junit.extensions.TestSetup.run(TestSetup.java:18)
          at junit.extensions.TestDecorator.basicRun(TestDecorator.java:24)
          at junit.extensions.TestSetup$1.protect(TestSetup.java:21)
          at junit.extensions.TestSetup.run(TestSetup.java:18)
          at org.apache.derbyTesting.junit.BaseTestSetup.run(BaseTestSetup.java:57)
          at junit.extensions.TestDecorator.basicRun(TestDecorator.java:24)
          at junit.extensions.TestSetup$1.protect(TestSetup.java:21)
          at junit.extensions.TestSetup.run(TestSetup.java:18)
          Caused by: org.apache.derby.client.am.SqlException: Connection authentication failure occurred. Reason: userid or password invalid.
          at org.apache.derby.client.net.NetConnection.mapSecchkcd(Unknown Source)
          at org.apache.derby.client.net.NetConnection.securityCheckComplete(Unknown Source)
          at org.apache.derby.client.net.NetConnectionReply.parseSECCHKRM(Unknown Source)
          at org.apache.derby.client.net.NetConnectionReply.parseSECCHKreply(Unknown Source)
          at org.apache.derby.client.net.NetConnectionReply.readSecurityCheck(Unknown Source)
          at org.apache.derby.client.net.NetConnection.readSecurityCheckAndAccessRdb(Unknown Source)
          at org.apache.derby.client.net.NetConnection.flowSecurityCheckAndAccessRdb(Unknown Source)
          at org.apache.derby.client.net.NetConnection.flowUSRIDPWDconnect(Unknown Source)
          at org.apache.derby.client.net.NetConnection.flowConnect(Unknown Source)
          at org.apache.derby.client.net.NetConnection.<init>(Unknown Source)
          at org.apache.derby.client.net.NetConnection40.<init>(Unknown Source)
          at org.apache.derby.client.net.ClientJDBCObjectFactoryImpl40.newNetConnection(Unknown Source)
          ... 52 more
          4) testChangePasswordAndDatabasePropertiesOnly(org.apache.derbyTesting.functionTests.tests.jdbcapi.DriverMgrAuthenticationTest)java.sql.SQLNonTransientConnectionException: Connection authentication failure occurred. Reason: userid or password invalid.
          at java.lang.Throwable.<init>(Throwable.java:67)
          at java.sql.SQLException.<init>(SQLException.java:101)
          at org.apache.derby.client.am.SQLExceptionFactory40.getSQLException(Unknown Source)
          at org.apache.derby.client.am.SqlException.getSQLException(Unknown Source)
          at org.apache.derby.jdbc.ClientDriver.connect(Unknown Source)
          at java.sql.DriverManager.getConnection(DriverManager.java:322)
          at java.sql.DriverManager.getConnection(DriverManager.java:297)
          at org.apache.derbyTesting.junit.DriverManagerConnector.openConnection(DriverManagerConnector.java:98)
          at org.apache.derbyTesting.junit.DriverManagerConnector.openConnection(DriverManagerConnector.java:43)
          at org.apache.derbyTesting.junit.TestConfiguration.openDefaultConnection(TestConfiguration.java:1574)
          at org.apache.derbyTesting.junit.BaseJDBCTestSetup.getConnection(BaseJDBCTestSetup.java:72)
          at org.apache.derbyTesting.junit.DatabasePropertyTestSetup.tearDown(DatabasePropertyTestSetup.java:288)
          at junit.extensions.TestSetup$1.protect(TestSetup.java:22)
          at junit.extensions.TestSetup.run(TestSetup.java:18)
          at org.apache.derbyTesting.junit.BaseTestSetup.run(BaseTestSetup.java:57)
          at junit.extensions.TestDecorator.basicRun(TestDecorator.java:24)
          at junit.extensions.TestSetup$1.protect(TestSetup.java:21)
          at junit.extensions.TestSetup.run(TestSetup.java:18)
          at junit.extensions.TestDecorator.basicRun(TestDecorator.java:24)
          at junit.extensions.TestSetup$1.protect(TestSetup.java:21)
          at junit.extensions.TestSetup.run(TestSetup.java:18)
          at org.apache.derbyTesting.junit.BaseTestSetup.run(BaseTestSetup.java:57)
          at junit.extensions.TestDecorator.basicRun(TestDecorator.java:24)
          at junit.extensions.TestSetup$1.protect(TestSetup.java:21)
          at junit.extensions.TestSetup.run(TestSetup.java:18)
          at junit.extensions.TestDecorator.basicRun(TestDecorator.java:24)
          at junit.extensions.TestSetup$1.protect(TestSetup.java:21)
          at junit.extensions.TestSetup.run(TestSetup.java:18)
          at org.apache.derbyTesting.junit.BaseTestSetup.run(BaseTestSetup.java:57)
          at junit.extensions.TestDecorator.basicRun(TestDecorator.java:24)
          at junit.extensions.TestSetup$1.protect(TestSetup.java:21)
          at junit.extensions.TestSetup.run(TestSetup.java:18)
          Caused by: org.apache.derby.client.am.SqlException: Connection authentication failure occurred. Reason: userid or password invalid.
          at org.apache.derby.client.net.NetConnection.mapSecchkcd(Unknown Source)
          at org.apache.derby.client.net.NetConnection.securityCheckComplete(Unknown Source)
          at org.apache.derby.client.net.NetConnectionReply.parseSECCHKRM(Unknown Source)
          at org.apache.derby.client.net.NetConnectionReply.parseSECCHKreply(Unknown Source)
          at org.apache.derby.client.net.NetConnectionReply.readSecurityCheck(Unknown Source)
          at org.apache.derby.client.net.NetConnection.readSecurityCheckAndAccessRdb(Unknown Source)
          at org.apache.derby.client.net.NetConnection.flowSecurityCheckAndAccessRdb(Unknown Source)
          at org.apache.derby.client.net.NetConnection.flowUSRIDPWDconnect(Unknown Source)
          at org.apache.derby.client.net.NetConnection.flowConnect(Unknown Source)
          at org.apache.derby.client.net.NetConnection.<init>(Unknown Source)
          at org.apache.derby.client.net.NetConnection40.<init>(Unknown Source)
          at org.apache.derby.client.net.ClientJDBCObjectFactoryImpl40.newNetConnection(Unknown Source)
          ... 47 more
          5) testGreekCharacters(org.apache.derbyTesting.functionTests.tests.jdbcapi.DriverMgrAuthenticationTest)java.sql.SQLNonTransientConnectionException: Connection authentication failure occurred. Reason: userid or password invalid.
          at java.lang.Throwable.<init>(Throwable.java:67)
          at java.sql.SQLException.<init>(SQLException.java:101)
          at org.apache.derby.client.am.SQLExceptionFactory40.getSQLException(Unknown Source)
          at org.apache.derby.client.am.SqlException.getSQLException(Unknown Source)
          at org.apache.derby.jdbc.ClientDriver.connect(Unknown Source)
          at java.sql.DriverManager.getConnection(DriverManager.java:322)
          at java.sql.DriverManager.getConnection(DriverManager.java:297)
          at org.apache.derbyTesting.junit.DriverManagerConnector.openConnection(DriverManagerConnector.java:98)
          at org.apache.derbyTesting.junit.DriverManagerConnector.openConnection(DriverManagerConnector.java:43)
          at org.apache.derbyTesting.junit.TestConfiguration.openDefaultConnection(TestConfiguration.java:1574)
          at org.apache.derbyTesting.junit.BaseJDBCTestSetup.getConnection(BaseJDBCTestSetup.java:72)
          at org.apache.derbyTesting.junit.DatabasePropertyTestSetup.setProperties(DatabasePropertyTestSetup.java:322)
          at org.apache.derbyTesting.junit.DatabasePropertyTestSetup.setUp(DatabasePropertyTestSetup.java:268)
          at junit.extensions.TestSetup$1.protect(TestSetup.java:20)
          at junit.extensions.TestSetup.run(TestSetup.java:18)
          at org.apache.derbyTesting.junit.BaseTestSetup.run(BaseTestSetup.java:57)
          at junit.extensions.TestDecorator.basicRun(TestDecorator.java:24)
          at junit.extensions.TestSetup$1.protect(TestSetup.java:21)
          at junit.extensions.TestSetup.run(TestSetup.java:18)
          at junit.extensions.TestDecorator.basicRun(TestDecorator.java:24)
          at junit.extensions.TestSetup$1.protect(TestSetup.java:21)
          at junit.extensions.TestSetup.run(TestSetup.java:18)
          at org.apache.derbyTesting.junit.BaseTestSetup.run(BaseTestSetup.java:57)
          at junit.extensions.TestDecorator.basicRun(TestDecorator.java:24)
          at junit.extensions.TestSetup$1.protect(TestSetup.java:21)
          at junit.extensions.TestSetup.run(TestSetup.java:18)
          at junit.extensions.TestDecorator.basicRun(TestDecorator.java:24)
          at junit.extensions.TestSetup$1.protect(TestSetup.java:21)
          at junit.extensions.TestSetup.run(TestSetup.java:18)
          at org.apache.derbyTesting.junit.BaseTestSetup.run(BaseTestSetup.java:57)
          at junit.extensions.TestDecorator.basicRun(TestDecorator.java:24)
          at junit.extensions.TestSetup$1.protect(TestSetup.java:21)
          at junit.extensions.TestSetup.run(TestSetup.java:18)
          Caused by: org.apache.derby.client.am.SqlException: Connection authentication failure occurred. Reason: userid or password invalid.
          at org.apache.derby.client.net.NetConnection.mapSecchkcd(Unknown Source)
          at org.apache.derby.client.net.NetConnection.securityCheckComplete(Unknown Source)
          at org.apache.derby.client.net.NetConnectionReply.parseSECCHKRM(Unknown Source)
          at org.apache.derby.client.net.NetConnectionReply.parseSECCHKreply(Unknown Source)
          at org.apache.derby.client.net.NetConnectionReply.readSecurityCheck(Unknown Source)
          at org.apache.derby.client.net.NetConnection.readSecurityCheckAndAccessRdb(Unknown Source)
          at org.apache.derby.client.net.NetConnection.flowSecurityCheckAndAccessRdb(Unknown Source)
          at org.apache.derby.client.net.NetConnection.flowUSRIDPWDconnect(Unknown Source)
          at org.apache.derby.client.net.NetConnection.flowConnect(Unknown Source)
          at org.apache.derby.client.net.NetConnection.<init>(Unknown Source)
          at org.apache.derby.client.net.NetConnection40.<init>(Unknown Source)
          at org.apache.derby.client.net.ClientJDBCObjectFactoryImpl40.newNetConnection(Unknown Source)
          ... 48 more
          6) testSystemShutdown(org.apache.derbyTesting.functionTests.tests.jdbcapi.DriverMgrAuthenticationTest)java.sql.SQLNonTransientConnectionException: Connection authentication failure occurred. Reason: userid or password invalid.
          at java.lang.Throwable.<init>(Throwable.java:67)
          at java.sql.SQLException.<init>(SQLException.java:101)
          at org.apache.derby.client.am.SQLExceptionFactory40.getSQLException(Unknown Source)
          at org.apache.derby.client.am.SqlException.getSQLException(Unknown Source)
          at org.apache.derby.jdbc.ClientDriver.connect(Unknown Source)
          at java.sql.DriverManager.getConnection(DriverManager.java:322)
          at java.sql.DriverManager.getConnection(DriverManager.java:297)
          at org.apache.derbyTesting.junit.DriverManagerConnector.openConnection(DriverManagerConnector.java:98)
          at org.apache.derbyTesting.junit.DriverManagerConnector.openConnection(DriverManagerConnector.java:43)
          at org.apache.derbyTesting.junit.TestConfiguration.openDefaultConnection(TestConfiguration.java:1574)
          at org.apache.derbyTesting.junit.BaseJDBCTestSetup.getConnection(BaseJDBCTestSetup.java:72)
          at org.apache.derbyTesting.junit.DatabasePropertyTestSetup.setProperties(DatabasePropertyTestSetup.java:322)
          at org.apache.derbyTesting.junit.DatabasePropertyTestSetup.setUp(DatabasePropertyTestSetup.java:268)
          at junit.extensions.TestSetup$1.protect(TestSetup.java:20)
          at junit.extensions.TestSetup.run(TestSetup.java:18)
          at org.apache.derbyTesting.junit.BaseTestSetup.run(BaseTestSetup.java:57)
          at junit.extensions.TestDecorator.basicRun(TestDecorator.java:24)
          at junit.extensions.TestSetup$1.protect(TestSetup.java:21)
          at junit.extensions.TestSetup.run(TestSetup.java:18)
          at junit.extensions.TestDecorator.basicRun(TestDecorator.java:24)
          at junit.extensions.TestSetup$1.protect(TestSetup.java:21)
          at junit.extensions.TestSetup.run(TestSetup.java:18)
          at org.apache.derbyTesting.junit.BaseTestSetup.run(BaseTestSetup.java:57)
          at junit.extensions.TestDecorator.basicRun(TestDecorator.java:24)
          at junit.extensions.TestSetup$1.protect(TestSetup.java:21)
          at junit.extensions.TestSetup.run(TestSetup.java:18)
          at junit.extensions.TestDecorator.basicRun(TestDecorator.java:24)
          at junit.extensions.TestSetup$1.protect(TestSetup.java:21)
          at junit.extensions.TestSetup.run(TestSetup.java:18)
          at org.apache.derbyTesting.junit.BaseTestSetup.run(BaseTestSetup.java:57)
          at junit.extensions.TestDecorator.basicRun(TestDecorator.java:24)
          at junit.extensions.TestSetup$1.protect(TestSetup.java:21)
          at junit.extensions.TestSetup.run(TestSetup.java:18)
          Caused by: org.apache.derby.client.am.SqlException: Connection authentication failure occurred. Reason: userid or password invalid.
          at org.apache.derby.client.net.NetConnection.mapSecchkcd(Unknown Source)
          at org.apache.derby.client.net.NetConnection.securityCheckComplete(Unknown Source)
          at org.apache.derby.client.net.NetConnectionReply.parseSECCHKRM(Unknown Source)
          at org.apache.derby.client.net.NetConnectionReply.parseSECCHKreply(Unknown Source)
          at org.apache.derby.client.net.NetConnectionReply.readSecurityCheck(Unknown Source)
          at org.apache.derby.client.net.NetConnection.readSecurityCheckAndAccessRdb(Unknown Source)
          at org.apache.derby.client.net.NetConnection.flowSecurityCheckAndAccessRdb(Unknown Source)
          at org.apache.derby.client.net.NetConnection.flowUSRIDPWDconnect(Unknown Source)
          at org.apache.derby.client.net.NetConnection.flowConnect(Unknown Source)
          at org.apache.derby.client.net.NetConnection.<init>(Unknown Source)
          at org.apache.derby.client.net.NetConnection40.<init>(Unknown Source)
          at org.apache.derby.client.net.ClientJDBCObjectFactoryImpl40.newNetConnection(Unknown Source)
          ... 48 more
          7) DriverMgrAuthenticationTestjava.sql.SQLNonTransientConnectionException: Connection authentication failure occurred. Reason: userid or password invalid.
          at java.lang.Throwable.<init>(Throwable.java:67)
          at java.sql.SQLException.<init>(SQLException.java:101)
          at org.apache.derby.client.am.SQLExceptionFactory40.getSQLException(Unknown Source)
          at org.apache.derby.client.am.SqlException.getSQLException(Unknown Source)
          at org.apache.derby.jdbc.ClientDriver.connect(Unknown Source)
          at java.sql.DriverManager.getConnection(DriverManager.java:322)
          at java.sql.DriverManager.getConnection(DriverManager.java:297)
          at org.apache.derbyTesting.junit.DriverManagerConnector.openConnection(DriverManagerConnector.java:98)
          at org.apache.derbyTesting.junit.DriverManagerConnector.openConnection(DriverManagerConnector.java:47)
          at org.apache.derbyTesting.junit.TestConfiguration.openConnection(TestConfiguration.java:1603)
          at org.apache.derbyTesting.junit.DropDatabaseSetup.tearDown(DropDatabaseSetup.java:54)
          at junit.extensions.TestSetup$1.protect(TestSetup.java:22)
          at junit.extensions.TestSetup.run(TestSetup.java:18)
          at org.apache.derbyTesting.junit.BaseTestSetup.run(BaseTestSetup.java:57)
          at junit.extensions.TestDecorator.basicRun(TestDecorator.java:24)
          at junit.extensions.TestSetup$1.protect(TestSetup.java:21)
          at junit.extensions.TestSetup.run(TestSetup.java:18)
          at junit.extensions.TestDecorator.basicRun(TestDecorator.java:24)
          at junit.extensions.TestSetup$1.protect(TestSetup.java:21)
          at junit.extensions.TestSetup.run(TestSetup.java:18)
          at org.apache.derbyTesting.junit.BaseTestSetup.run(BaseTestSetup.java:57)
          at junit.extensions.TestDecorator.basicRun(TestDecorator.java:24)
          at junit.extensions.TestSetup$1.protect(TestSetup.java:21)
          at junit.extensions.TestSetup.run(TestSetup.java:18)
          Caused by: org.apache.derby.client.am.SqlException: Connection authentication failure occurred. Reason: userid or password invalid.
          at org.apache.derby.client.net.NetConnection.mapSecchkcd(Unknown Source)
          at org.apache.derby.client.net.NetConnection.securityCheckComplete(Unknown Source)
          at org.apache.derby.client.net.NetConnectionReply.parseSECCHKRM(Unknown Source)
          at org.apache.derby.client.net.NetConnectionReply.parseSECCHKreply(Unknown Source)
          at org.apache.derby.client.net.NetConnectionReply.readSecurityCheck(Unknown Source)
          at org.apache.derby.client.net.NetConnection.readSecurityCheckAndAccessRdb(Unknown Source)
          at org.apache.derby.client.net.NetConnection.flowSecurityCheckAndAccessRdb(Unknown Source)
          at org.apache.derby.client.net.NetConnection.flowUSRIDPWDconnect(Unknown Source)
          at org.apache.derby.client.net.NetConnection.flowConnect(Unknown Source)
          at org.apache.derby.client.net.NetConnection.<init>(Unknown Source)
          at org.apache.derby.client.net.NetConnection40.<init>(Unknown Source)
          at org.apache.derby.client.net.ClientJDBCObjectFactoryImpl40.newNetConnection(Unknown Source)
          ... 35 more
          There was 1 failure:

          Show
          Mike Matrigali added a comment - Errors from the following build: http://people.apache.org/~myrnavl/derby_test_results/main/windows/testlog/ibm16/1232722-suites.All_diff.txt 1) testChangePasswordAndDatabasePropertiesOnly(org.apache.derbyTesting.functionTests.tests.jdbcapi.DriverMgrAuthenticationTest)java.sql.SQLException: An SQL data change is not permitted for a read-only connection, user or database. at org.apache.derby.client.am.SQLExceptionFactory40.getSQLException(Unknown Source) at org.apache.derby.client.am.SqlException.getSQLException(Unknown Source) at org.apache.derby.client.am.PreparedStatement.execute(Unknown Source) at org.apache.derbyTesting.functionTests.tests.jdbcapi.AuthenticationTest.setDatabaseProperty(AuthenticationTest.java:1297) at org.apache.derbyTesting.functionTests.tests.jdbcapi.AuthenticationTest.setUp(AuthenticationTest.java:192) at org.apache.derbyTesting.junit.BaseTestCase.runBare(BaseTestCase.java:116) at junit.extensions.TestDecorator.basicRun(TestDecorator.java:24) at junit.extensions.TestSetup$1.protect(TestSetup.java:21) at junit.extensions.TestSetup.run(TestSetup.java:18) at org.apache.derbyTesting.junit.BaseTestSetup.run(BaseTestSetup.java:57) at junit.extensions.TestDecorator.basicRun(TestDecorator.java:24) at junit.extensions.TestSetup$1.protect(TestSetup.java:21) at junit.extensions.TestSetup.run(TestSetup.java:18) at junit.extensions.TestDecorator.basicRun(TestDecorator.java:24) at junit.extensions.TestSetup$1.protect(TestSetup.java:21) at junit.extensions.TestSetup.run(TestSetup.java:18) at org.apache.derbyTesting.junit.BaseTestSetup.run(BaseTestSetup.java:57) at junit.extensions.TestDecorator.basicRun(TestDecorator.java:24) at junit.extensions.TestSetup$1.protect(TestSetup.java:21) at junit.extensions.TestSetup.run(TestSetup.java:18) at org.apache.derbyTesting.junit.BaseTestSetup.run(BaseTestSetup.java:57) at junit.extensions.TestDecorator.basicRun(TestDecorator.java:24) at junit.extensions.TestSetup$1.protect(TestSetup.java:21) at junit.extensions.TestSetup.run(TestSetup.java:18) at junit.extensions.TestDecorator.basicRun(TestDecorator.java:24) at junit.extensions.TestSetup$1.protect(TestSetup.java:21) at junit.extensions.TestSetup.run(TestSetup.java:18) at org.apache.derbyTesting.junit.BaseTestSetup.run(BaseTestSetup.java:57) at junit.extensions.TestDecorator.basicRun(TestDecorator.java:24) at junit.extensions.TestSetup$1.protect(TestSetup.java:21) at junit.extensions.TestSetup.run(TestSetup.java:18) at junit.extensions.TestDecorator.basicRun(TestDecorator.java:24) at junit.extensions.TestSetup$1.protect(TestSetup.java:21) at junit.extensions.TestSetup.run(TestSetup.java:18) at org.apache.derbyTesting.junit.BaseTestSetup.run(BaseTestSetup.java:57) at junit.extensions.TestDecorator.basicRun(TestDecorator.java:24) at junit.extensions.TestSetup$1.protect(TestSetup.java:21) at junit.extensions.TestSetup.run(TestSetup.java:18) Caused by: org.apache.derby.client.am.SqlException: An SQL data change is not permitted for a read-only connection, user or database. at org.apache.derby.client.am.Statement.completeExecute(Unknown Source) at org.apache.derby.client.net.NetStatementReply.parseEXCSQLSTTreply(Unknown Source) at org.apache.derby.client.net.NetStatementReply.readExecuteCall(Unknown Source) at org.apache.derby.client.net.StatementReply.readExecuteCall(Unknown Source) at org.apache.derby.client.net.NetStatement.readExecuteCall_(Unknown Source) at org.apache.derby.client.am.Statement.readExecuteCall(Unknown Source) at org.apache.derby.client.am.PreparedStatement.flowExecute(Unknown Source) at org.apache.derby.client.am.PreparedStatement.executeX(Unknown Source) ... 63 more 2) testChangePasswordAndDatabasePropertiesOnly(org.apache.derbyTesting.functionTests.tests.jdbcapi.DriverMgrAuthenticationTest)java.sql.SQLException: An SQL data change is not permitted for a read-only connection, user or database. at org.apache.derby.client.am.SQLExceptionFactory40.getSQLException(Unknown Source) at org.apache.derby.client.am.SqlException.getSQLException(Unknown Source) at org.apache.derby.client.am.PreparedStatement.executeUpdate(Unknown Source) at org.apache.derbyTesting.junit.DatabasePropertyTestSetup.tearDown(DatabasePropertyTestSetup.java:294) at junit.extensions.TestSetup$1.protect(TestSetup.java:22) at junit.extensions.TestSetup.run(TestSetup.java:18) at org.apache.derbyTesting.junit.BaseTestSetup.run(BaseTestSetup.java:57) at junit.extensions.TestDecorator.basicRun(TestDecorator.java:24) at junit.extensions.TestSetup$1.protect(TestSetup.java:21) at junit.extensions.TestSetup.run(TestSetup.java:18) at junit.extensions.TestDecorator.basicRun(TestDecorator.java:24) at junit.extensions.TestSetup$1.protect(TestSetup.java:21) at junit.extensions.TestSetup.run(TestSetup.java:18) at org.apache.derbyTesting.junit.BaseTestSetup.run(BaseTestSetup.java:57) at junit.extensions.TestDecorator.basicRun(TestDecorator.java:24) at junit.extensions.TestSetup$1.protect(TestSetup.java:21) at junit.extensions.TestSetup.run(TestSetup.java:18) at org.apache.derbyTesting.junit.BaseTestSetup.run(BaseTestSetup.java:57) at junit.extensions.TestDecorator.basicRun(TestDecorator.java:24) at junit.extensions.TestSetup$1.protect(TestSetup.java:21) at junit.extensions.TestSetup.run(TestSetup.java:18) at junit.extensions.TestDecorator.basicRun(TestDecorator.java:24) at junit.extensions.TestSetup$1.protect(TestSetup.java:21) at junit.extensions.TestSetup.run(TestSetup.java:18) at org.apache.derbyTesting.junit.BaseTestSetup.run(BaseTestSetup.java:57) at junit.extensions.TestDecorator.basicRun(TestDecorator.java:24) at junit.extensions.TestSetup$1.protect(TestSetup.java:21) at junit.extensions.TestSetup.run(TestSetup.java:18) at junit.extensions.TestDecorator.basicRun(TestDecorator.java:24) at junit.extensions.TestSetup$1.protect(TestSetup.java:21) at junit.extensions.TestSetup.run(TestSetup.java:18) at org.apache.derbyTesting.junit.BaseTestSetup.run(BaseTestSetup.java:57) at junit.extensions.TestDecorator.basicRun(TestDecorator.java:24) at junit.extensions.TestSetup$1.protect(TestSetup.java:21) at junit.extensions.TestSetup.run(TestSetup.java:18) Caused by: org.apache.derby.client.am.SqlException: An SQL data change is not permitted for a read-only connection, user or database. at org.apache.derby.client.am.Statement.completeExecute(Unknown Source) at org.apache.derby.client.net.NetStatementReply.parseEXCSQLSTTreply(Unknown Source) at org.apache.derby.client.net.NetStatementReply.readExecuteCall(Unknown Source) at org.apache.derby.client.net.StatementReply.readExecuteCall(Unknown Source) at org.apache.derby.client.net.NetStatement.readExecuteCall_(Unknown Source) at org.apache.derby.client.am.Statement.readExecuteCall(Unknown Source) at org.apache.derby.client.am.PreparedStatement.flowExecute(Unknown Source) at org.apache.derby.client.am.PreparedStatement.executeUpdateX(Unknown Source) ... 55 more 3) testChangePasswordAndDatabasePropertiesOnly(org.apache.derbyTesting.functionTests.tests.jdbcapi.DriverMgrAuthenticationTest)java.sql.SQLNonTransientConnectionException: Connection authentication failure occurred. Reason: userid or password invalid. at java.lang.Throwable.<init>(Throwable.java:67) at java.sql.SQLException.<init>(SQLException.java:101) at org.apache.derby.client.am.SQLExceptionFactory40.getSQLException(Unknown Source) at org.apache.derby.client.am.SqlException.getSQLException(Unknown Source) at org.apache.derby.jdbc.ClientDriver.connect(Unknown Source) at java.sql.DriverManager.getConnection(DriverManager.java:322) at java.sql.DriverManager.getConnection(DriverManager.java:297) at org.apache.derbyTesting.junit.DriverManagerConnector.openConnection(DriverManagerConnector.java:98) at org.apache.derbyTesting.junit.DriverManagerConnector.openConnection(DriverManagerConnector.java:43) at org.apache.derbyTesting.junit.TestConfiguration.openDefaultConnection(TestConfiguration.java:1574) at org.apache.derbyTesting.junit.BaseJDBCTestSetup.getConnection(BaseJDBCTestSetup.java:72) at org.apache.derbyTesting.junit.DatabasePropertyTestSetup.tearDown(DatabasePropertyTestSetup.java:288) at junit.extensions.TestSetup$1.protect(TestSetup.java:22) at junit.extensions.TestSetup.run(TestSetup.java:18) at org.apache.derbyTesting.junit.BaseTestSetup.run(BaseTestSetup.java:57) at junit.extensions.TestDecorator.basicRun(TestDecorator.java:24) at junit.extensions.TestSetup$1.protect(TestSetup.java:21) at junit.extensions.TestSetup.run(TestSetup.java:18) at org.apache.derbyTesting.junit.BaseTestSetup.run(BaseTestSetup.java:57) at junit.extensions.TestDecorator.basicRun(TestDecorator.java:24) at junit.extensions.TestSetup$1.protect(TestSetup.java:21) at junit.extensions.TestSetup.run(TestSetup.java:18) at junit.extensions.TestDecorator.basicRun(TestDecorator.java:24) at junit.extensions.TestSetup$1.protect(TestSetup.java:21) at junit.extensions.TestSetup.run(TestSetup.java:18) at org.apache.derbyTesting.junit.BaseTestSetup.run(BaseTestSetup.java:57) at junit.extensions.TestDecorator.basicRun(TestDecorator.java:24) at junit.extensions.TestSetup$1.protect(TestSetup.java:21) at junit.extensions.TestSetup.run(TestSetup.java:18) at junit.extensions.TestDecorator.basicRun(TestDecorator.java:24) at junit.extensions.TestSetup$1.protect(TestSetup.java:21) at junit.extensions.TestSetup.run(TestSetup.java:18) at org.apache.derbyTesting.junit.BaseTestSetup.run(BaseTestSetup.java:57) at junit.extensions.TestDecorator.basicRun(TestDecorator.java:24) at junit.extensions.TestSetup$1.protect(TestSetup.java:21) at junit.extensions.TestSetup.run(TestSetup.java:18) Caused by: org.apache.derby.client.am.SqlException: Connection authentication failure occurred. Reason: userid or password invalid. at org.apache.derby.client.net.NetConnection.mapSecchkcd(Unknown Source) at org.apache.derby.client.net.NetConnection.securityCheckComplete(Unknown Source) at org.apache.derby.client.net.NetConnectionReply.parseSECCHKRM(Unknown Source) at org.apache.derby.client.net.NetConnectionReply.parseSECCHKreply(Unknown Source) at org.apache.derby.client.net.NetConnectionReply.readSecurityCheck(Unknown Source) at org.apache.derby.client.net.NetConnection.readSecurityCheckAndAccessRdb(Unknown Source) at org.apache.derby.client.net.NetConnection.flowSecurityCheckAndAccessRdb(Unknown Source) at org.apache.derby.client.net.NetConnection.flowUSRIDPWDconnect(Unknown Source) at org.apache.derby.client.net.NetConnection.flowConnect(Unknown Source) at org.apache.derby.client.net.NetConnection.<init>(Unknown Source) at org.apache.derby.client.net.NetConnection40.<init>(Unknown Source) at org.apache.derby.client.net.ClientJDBCObjectFactoryImpl40.newNetConnection(Unknown Source) ... 52 more 4) testChangePasswordAndDatabasePropertiesOnly(org.apache.derbyTesting.functionTests.tests.jdbcapi.DriverMgrAuthenticationTest)java.sql.SQLNonTransientConnectionException: Connection authentication failure occurred. Reason: userid or password invalid. at java.lang.Throwable.<init>(Throwable.java:67) at java.sql.SQLException.<init>(SQLException.java:101) at org.apache.derby.client.am.SQLExceptionFactory40.getSQLException(Unknown Source) at org.apache.derby.client.am.SqlException.getSQLException(Unknown Source) at org.apache.derby.jdbc.ClientDriver.connect(Unknown Source) at java.sql.DriverManager.getConnection(DriverManager.java:322) at java.sql.DriverManager.getConnection(DriverManager.java:297) at org.apache.derbyTesting.junit.DriverManagerConnector.openConnection(DriverManagerConnector.java:98) at org.apache.derbyTesting.junit.DriverManagerConnector.openConnection(DriverManagerConnector.java:43) at org.apache.derbyTesting.junit.TestConfiguration.openDefaultConnection(TestConfiguration.java:1574) at org.apache.derbyTesting.junit.BaseJDBCTestSetup.getConnection(BaseJDBCTestSetup.java:72) at org.apache.derbyTesting.junit.DatabasePropertyTestSetup.tearDown(DatabasePropertyTestSetup.java:288) at junit.extensions.TestSetup$1.protect(TestSetup.java:22) at junit.extensions.TestSetup.run(TestSetup.java:18) at org.apache.derbyTesting.junit.BaseTestSetup.run(BaseTestSetup.java:57) at junit.extensions.TestDecorator.basicRun(TestDecorator.java:24) at junit.extensions.TestSetup$1.protect(TestSetup.java:21) at junit.extensions.TestSetup.run(TestSetup.java:18) at junit.extensions.TestDecorator.basicRun(TestDecorator.java:24) at junit.extensions.TestSetup$1.protect(TestSetup.java:21) at junit.extensions.TestSetup.run(TestSetup.java:18) at org.apache.derbyTesting.junit.BaseTestSetup.run(BaseTestSetup.java:57) at junit.extensions.TestDecorator.basicRun(TestDecorator.java:24) at junit.extensions.TestSetup$1.protect(TestSetup.java:21) at junit.extensions.TestSetup.run(TestSetup.java:18) at junit.extensions.TestDecorator.basicRun(TestDecorator.java:24) at junit.extensions.TestSetup$1.protect(TestSetup.java:21) at junit.extensions.TestSetup.run(TestSetup.java:18) at org.apache.derbyTesting.junit.BaseTestSetup.run(BaseTestSetup.java:57) at junit.extensions.TestDecorator.basicRun(TestDecorator.java:24) at junit.extensions.TestSetup$1.protect(TestSetup.java:21) at junit.extensions.TestSetup.run(TestSetup.java:18) Caused by: org.apache.derby.client.am.SqlException: Connection authentication failure occurred. Reason: userid or password invalid. at org.apache.derby.client.net.NetConnection.mapSecchkcd(Unknown Source) at org.apache.derby.client.net.NetConnection.securityCheckComplete(Unknown Source) at org.apache.derby.client.net.NetConnectionReply.parseSECCHKRM(Unknown Source) at org.apache.derby.client.net.NetConnectionReply.parseSECCHKreply(Unknown Source) at org.apache.derby.client.net.NetConnectionReply.readSecurityCheck(Unknown Source) at org.apache.derby.client.net.NetConnection.readSecurityCheckAndAccessRdb(Unknown Source) at org.apache.derby.client.net.NetConnection.flowSecurityCheckAndAccessRdb(Unknown Source) at org.apache.derby.client.net.NetConnection.flowUSRIDPWDconnect(Unknown Source) at org.apache.derby.client.net.NetConnection.flowConnect(Unknown Source) at org.apache.derby.client.net.NetConnection.<init>(Unknown Source) at org.apache.derby.client.net.NetConnection40.<init>(Unknown Source) at org.apache.derby.client.net.ClientJDBCObjectFactoryImpl40.newNetConnection(Unknown Source) ... 47 more 5) testGreekCharacters(org.apache.derbyTesting.functionTests.tests.jdbcapi.DriverMgrAuthenticationTest)java.sql.SQLNonTransientConnectionException: Connection authentication failure occurred. Reason: userid or password invalid. at java.lang.Throwable.<init>(Throwable.java:67) at java.sql.SQLException.<init>(SQLException.java:101) at org.apache.derby.client.am.SQLExceptionFactory40.getSQLException(Unknown Source) at org.apache.derby.client.am.SqlException.getSQLException(Unknown Source) at org.apache.derby.jdbc.ClientDriver.connect(Unknown Source) at java.sql.DriverManager.getConnection(DriverManager.java:322) at java.sql.DriverManager.getConnection(DriverManager.java:297) at org.apache.derbyTesting.junit.DriverManagerConnector.openConnection(DriverManagerConnector.java:98) at org.apache.derbyTesting.junit.DriverManagerConnector.openConnection(DriverManagerConnector.java:43) at org.apache.derbyTesting.junit.TestConfiguration.openDefaultConnection(TestConfiguration.java:1574) at org.apache.derbyTesting.junit.BaseJDBCTestSetup.getConnection(BaseJDBCTestSetup.java:72) at org.apache.derbyTesting.junit.DatabasePropertyTestSetup.setProperties(DatabasePropertyTestSetup.java:322) at org.apache.derbyTesting.junit.DatabasePropertyTestSetup.setUp(DatabasePropertyTestSetup.java:268) at junit.extensions.TestSetup$1.protect(TestSetup.java:20) at junit.extensions.TestSetup.run(TestSetup.java:18) at org.apache.derbyTesting.junit.BaseTestSetup.run(BaseTestSetup.java:57) at junit.extensions.TestDecorator.basicRun(TestDecorator.java:24) at junit.extensions.TestSetup$1.protect(TestSetup.java:21) at junit.extensions.TestSetup.run(TestSetup.java:18) at junit.extensions.TestDecorator.basicRun(TestDecorator.java:24) at junit.extensions.TestSetup$1.protect(TestSetup.java:21) at junit.extensions.TestSetup.run(TestSetup.java:18) at org.apache.derbyTesting.junit.BaseTestSetup.run(BaseTestSetup.java:57) at junit.extensions.TestDecorator.basicRun(TestDecorator.java:24) at junit.extensions.TestSetup$1.protect(TestSetup.java:21) at junit.extensions.TestSetup.run(TestSetup.java:18) at junit.extensions.TestDecorator.basicRun(TestDecorator.java:24) at junit.extensions.TestSetup$1.protect(TestSetup.java:21) at junit.extensions.TestSetup.run(TestSetup.java:18) at org.apache.derbyTesting.junit.BaseTestSetup.run(BaseTestSetup.java:57) at junit.extensions.TestDecorator.basicRun(TestDecorator.java:24) at junit.extensions.TestSetup$1.protect(TestSetup.java:21) at junit.extensions.TestSetup.run(TestSetup.java:18) Caused by: org.apache.derby.client.am.SqlException: Connection authentication failure occurred. Reason: userid or password invalid. at org.apache.derby.client.net.NetConnection.mapSecchkcd(Unknown Source) at org.apache.derby.client.net.NetConnection.securityCheckComplete(Unknown Source) at org.apache.derby.client.net.NetConnectionReply.parseSECCHKRM(Unknown Source) at org.apache.derby.client.net.NetConnectionReply.parseSECCHKreply(Unknown Source) at org.apache.derby.client.net.NetConnectionReply.readSecurityCheck(Unknown Source) at org.apache.derby.client.net.NetConnection.readSecurityCheckAndAccessRdb(Unknown Source) at org.apache.derby.client.net.NetConnection.flowSecurityCheckAndAccessRdb(Unknown Source) at org.apache.derby.client.net.NetConnection.flowUSRIDPWDconnect(Unknown Source) at org.apache.derby.client.net.NetConnection.flowConnect(Unknown Source) at org.apache.derby.client.net.NetConnection.<init>(Unknown Source) at org.apache.derby.client.net.NetConnection40.<init>(Unknown Source) at org.apache.derby.client.net.ClientJDBCObjectFactoryImpl40.newNetConnection(Unknown Source) ... 48 more 6) testSystemShutdown(org.apache.derbyTesting.functionTests.tests.jdbcapi.DriverMgrAuthenticationTest)java.sql.SQLNonTransientConnectionException: Connection authentication failure occurred. Reason: userid or password invalid. at java.lang.Throwable.<init>(Throwable.java:67) at java.sql.SQLException.<init>(SQLException.java:101) at org.apache.derby.client.am.SQLExceptionFactory40.getSQLException(Unknown Source) at org.apache.derby.client.am.SqlException.getSQLException(Unknown Source) at org.apache.derby.jdbc.ClientDriver.connect(Unknown Source) at java.sql.DriverManager.getConnection(DriverManager.java:322) at java.sql.DriverManager.getConnection(DriverManager.java:297) at org.apache.derbyTesting.junit.DriverManagerConnector.openConnection(DriverManagerConnector.java:98) at org.apache.derbyTesting.junit.DriverManagerConnector.openConnection(DriverManagerConnector.java:43) at org.apache.derbyTesting.junit.TestConfiguration.openDefaultConnection(TestConfiguration.java:1574) at org.apache.derbyTesting.junit.BaseJDBCTestSetup.getConnection(BaseJDBCTestSetup.java:72) at org.apache.derbyTesting.junit.DatabasePropertyTestSetup.setProperties(DatabasePropertyTestSetup.java:322) at org.apache.derbyTesting.junit.DatabasePropertyTestSetup.setUp(DatabasePropertyTestSetup.java:268) at junit.extensions.TestSetup$1.protect(TestSetup.java:20) at junit.extensions.TestSetup.run(TestSetup.java:18) at org.apache.derbyTesting.junit.BaseTestSetup.run(BaseTestSetup.java:57) at junit.extensions.TestDecorator.basicRun(TestDecorator.java:24) at junit.extensions.TestSetup$1.protect(TestSetup.java:21) at junit.extensions.TestSetup.run(TestSetup.java:18) at junit.extensions.TestDecorator.basicRun(TestDecorator.java:24) at junit.extensions.TestSetup$1.protect(TestSetup.java:21) at junit.extensions.TestSetup.run(TestSetup.java:18) at org.apache.derbyTesting.junit.BaseTestSetup.run(BaseTestSetup.java:57) at junit.extensions.TestDecorator.basicRun(TestDecorator.java:24) at junit.extensions.TestSetup$1.protect(TestSetup.java:21) at junit.extensions.TestSetup.run(TestSetup.java:18) at junit.extensions.TestDecorator.basicRun(TestDecorator.java:24) at junit.extensions.TestSetup$1.protect(TestSetup.java:21) at junit.extensions.TestSetup.run(TestSetup.java:18) at org.apache.derbyTesting.junit.BaseTestSetup.run(BaseTestSetup.java:57) at junit.extensions.TestDecorator.basicRun(TestDecorator.java:24) at junit.extensions.TestSetup$1.protect(TestSetup.java:21) at junit.extensions.TestSetup.run(TestSetup.java:18) Caused by: org.apache.derby.client.am.SqlException: Connection authentication failure occurred. Reason: userid or password invalid. at org.apache.derby.client.net.NetConnection.mapSecchkcd(Unknown Source) at org.apache.derby.client.net.NetConnection.securityCheckComplete(Unknown Source) at org.apache.derby.client.net.NetConnectionReply.parseSECCHKRM(Unknown Source) at org.apache.derby.client.net.NetConnectionReply.parseSECCHKreply(Unknown Source) at org.apache.derby.client.net.NetConnectionReply.readSecurityCheck(Unknown Source) at org.apache.derby.client.net.NetConnection.readSecurityCheckAndAccessRdb(Unknown Source) at org.apache.derby.client.net.NetConnection.flowSecurityCheckAndAccessRdb(Unknown Source) at org.apache.derby.client.net.NetConnection.flowUSRIDPWDconnect(Unknown Source) at org.apache.derby.client.net.NetConnection.flowConnect(Unknown Source) at org.apache.derby.client.net.NetConnection.<init>(Unknown Source) at org.apache.derby.client.net.NetConnection40.<init>(Unknown Source) at org.apache.derby.client.net.ClientJDBCObjectFactoryImpl40.newNetConnection(Unknown Source) ... 48 more 7) DriverMgrAuthenticationTestjava.sql.SQLNonTransientConnectionException: Connection authentication failure occurred. Reason: userid or password invalid. at java.lang.Throwable.<init>(Throwable.java:67) at java.sql.SQLException.<init>(SQLException.java:101) at org.apache.derby.client.am.SQLExceptionFactory40.getSQLException(Unknown Source) at org.apache.derby.client.am.SqlException.getSQLException(Unknown Source) at org.apache.derby.jdbc.ClientDriver.connect(Unknown Source) at java.sql.DriverManager.getConnection(DriverManager.java:322) at java.sql.DriverManager.getConnection(DriverManager.java:297) at org.apache.derbyTesting.junit.DriverManagerConnector.openConnection(DriverManagerConnector.java:98) at org.apache.derbyTesting.junit.DriverManagerConnector.openConnection(DriverManagerConnector.java:47) at org.apache.derbyTesting.junit.TestConfiguration.openConnection(TestConfiguration.java:1603) at org.apache.derbyTesting.junit.DropDatabaseSetup.tearDown(DropDatabaseSetup.java:54) at junit.extensions.TestSetup$1.protect(TestSetup.java:22) at junit.extensions.TestSetup.run(TestSetup.java:18) at org.apache.derbyTesting.junit.BaseTestSetup.run(BaseTestSetup.java:57) at junit.extensions.TestDecorator.basicRun(TestDecorator.java:24) at junit.extensions.TestSetup$1.protect(TestSetup.java:21) at junit.extensions.TestSetup.run(TestSetup.java:18) at junit.extensions.TestDecorator.basicRun(TestDecorator.java:24) at junit.extensions.TestSetup$1.protect(TestSetup.java:21) at junit.extensions.TestSetup.run(TestSetup.java:18) at org.apache.derbyTesting.junit.BaseTestSetup.run(BaseTestSetup.java:57) at junit.extensions.TestDecorator.basicRun(TestDecorator.java:24) at junit.extensions.TestSetup$1.protect(TestSetup.java:21) at junit.extensions.TestSetup.run(TestSetup.java:18) Caused by: org.apache.derby.client.am.SqlException: Connection authentication failure occurred. Reason: userid or password invalid. at org.apache.derby.client.net.NetConnection.mapSecchkcd(Unknown Source) at org.apache.derby.client.net.NetConnection.securityCheckComplete(Unknown Source) at org.apache.derby.client.net.NetConnectionReply.parseSECCHKRM(Unknown Source) at org.apache.derby.client.net.NetConnectionReply.parseSECCHKreply(Unknown Source) at org.apache.derby.client.net.NetConnectionReply.readSecurityCheck(Unknown Source) at org.apache.derby.client.net.NetConnection.readSecurityCheckAndAccessRdb(Unknown Source) at org.apache.derby.client.net.NetConnection.flowSecurityCheckAndAccessRdb(Unknown Source) at org.apache.derby.client.net.NetConnection.flowUSRIDPWDconnect(Unknown Source) at org.apache.derby.client.net.NetConnection.flowConnect(Unknown Source) at org.apache.derby.client.net.NetConnection.<init>(Unknown Source) at org.apache.derby.client.net.NetConnection40.<init>(Unknown Source) at org.apache.derby.client.net.ClientJDBCObjectFactoryImpl40.newNetConnection(Unknown Source) ... 35 more There was 1 failure:
          Hide
          Mike Matrigali added a comment -

          errors from following build:
          http://people.apache.org/~myrnavl/derby_test_results/main/windows/testlog/ibm16/1230376-suites.All_diff.txt

          1) testConnectShutdownAuthentication(org.apache.derbyTesting.functionTests.tests.jdbcapi.DriverMgrAuthenticationTest)java.sql.SQLException: An SQL data change is not permitted for a read-only connection, user or database.
          at java.lang.Throwable.<init>(Throwable.java:80)
          at java.sql.SQLException.<init>(SQLException.java:153)
          at java.sql.SQLException.<init>(SQLException.java:176)
          at org.apache.derby.impl.jdbc.SQLExceptionFactory40.getSQLException(Unknown Source)
          at org.apache.derby.impl.jdbc.Util.generateCsSQLException(Unknown Source)
          at org.apache.derby.impl.jdbc.TransactionResourceImpl.wrapInSQLException(Unknown Source)
          at org.apache.derby.impl.jdbc.TransactionResourceImpl.handleException(Unknown Source)
          at org.apache.derby.impl.jdbc.EmbedConnection.handleException(Unknown Source)
          at org.apache.derby.impl.jdbc.ConnectionChild.handleException(Unknown Source)
          at org.apache.derby.impl.jdbc.EmbedStatement.executeStatement(Unknown Source)
          at org.apache.derby.impl.jdbc.EmbedPreparedStatement.executeStatement(Unknown Source)
          at org.apache.derby.impl.jdbc.EmbedCallableStatement.executeStatement(Unknown Source)
          at org.apache.derby.impl.jdbc.EmbedPreparedStatement.execute(Unknown Source)
          at org.apache.derbyTesting.functionTests.tests.jdbcapi.AuthenticationTest.setDatabaseProperty(AuthenticationTest.java:1297)
          at org.apache.derbyTesting.functionTests.tests.jdbcapi.AuthenticationTest.testConnectShutdownAuthentication(AuthenticationTest.java:512)
          at sun.reflect.NativeMethodAccessorImpl.invoke0(Native Method)
          at sun.reflect.NativeMethodAccessorImpl.invoke(NativeMethodAccessorImpl.java:60)
          at sun.reflect.DelegatingMethodAccessorImpl.invoke(DelegatingMethodAccessorImpl.java:37)
          at org.apache.derbyTesting.junit.BaseTestCase.runBare(BaseTestCase.java:116)
          at junit.extensions.TestDecorator.basicRun(TestDecorator.java:24)
          at junit.extensions.TestSetup$1.protect(TestSetup.java:21)
          at junit.extensions.TestSetup.run(TestSetup.java:18)
          at org.apache.derbyTesting.junit.BaseTestSetup.run(BaseTestSetup.java:57)
          at junit.extensions.TestDecorator.basicRun(TestDecorator.java:24)
          at junit.extensions.TestSetup$1.protect(TestSetup.java:21)
          at junit.extensions.TestSetup.run(TestSetup.java:18)
          at junit.extensions.TestDecorator.basicRun(TestDecorator.java:24)
          at junit.extensions.TestSetup$1.protect(TestSetup.java:21)
          at junit.extensions.TestSetup.run(TestSetup.java:18)
          at org.apache.derbyTesting.junit.BaseTestSetup.run(BaseTestSetup.java:57)
          at junit.extensions.TestDecorator.basicRun(TestDecorator.java:24)
          at junit.extensions.TestSetup$1.protect(TestSetup.java:21)
          at junit.extensions.TestSetup.run(TestSetup.java:18)
          at org.apache.derbyTesting.junit.BaseTestSetup.run(BaseTestSetup.java:57)
          at junit.extensions.TestDecorator.basicRun(TestDecorator.java:24)
          at junit.extensions.TestSetup$1.protect(TestSetup.java:21)
          at junit.extensions.TestSetup.run(TestSetup.java:18)
          at junit.extensions.TestDecorator.basicRun(TestDecorator.java:24)
          at junit.extensions.TestSetup$1.protect(TestSetup.java:21)
          at junit.extensions.TestSetup.run(TestSetup.java:18)
          at org.apache.derbyTesting.junit.BaseTestSetup.run(BaseTestSetup.java:57)
          at junit.extensions.TestDecorator.basicRun(TestDecorator.java:24)
          at junit.extensions.TestSetup$1.protect(TestSetup.java:21)
          at junit.extensions.TestSetup.run(TestSetup.java:18)
          Caused by: java.sql.SQLException: An SQL data change is not permitted for a read-only connection, user or database.
          at org.apache.derby.impl.jdbc.SQLExceptionFactory.getSQLException(Unknown Source)
          at org.apache.derby.impl.jdbc.SQLExceptionFactory40.wrapArgsForTransportAcrossDRDA(Unknown Source)
          ... 68 more
          Caused by: ERROR 25502: An SQL data change is not permitted for a read-only connection, user or database.
          at org.apache.derby.iapi.error.StandardException.newException(Unknown Source)
          at org.apache.derby.impl.sql.conn.GenericAuthorizer.authorize(Unknown Source)
          at org.apache.derby.exe.ac2bd9f4bdx0134xd201x1a93xffffc6d89d380.g0(Unknown Source)
          at sun.reflect.NativeMethodAccessorImpl.invoke0(Native Method)
          at sun.reflect.NativeMethodAccessorImpl.invoke(NativeMethodAccessorImpl.java:60)
          at sun.reflect.DelegatingMethodAccessorImpl.invoke(DelegatingMethodAccessorImpl.java:37)
          at org.apache.derby.impl.services.reflect.ReflectMethod.invoke(Unknown Source)
          at org.apache.derby.impl.sql.execute.CallStatementResultSet.open(Unknown Source)
          at org.apache.derby.impl.sql.GenericPreparedStatement.executeStmt(Unknown Source)
          at org.apache.derby.impl.sql.GenericPreparedStatement.execute(Unknown Source)
          ... 62 more
          2) testConnectShutdownAuthentication(org.apache.derbyTesting.functionTests.tests.jdbcapi.DriverMgrAuthenticationTest)java.sql.SQLNonTransientConnectionException: Database connection refused.
          at java.lang.Throwable.<init>(Throwable.java:80)
          at java.sql.SQLException.<init>(SQLException.java:153)
          at java.sql.SQLException.<init>(SQLException.java:176)
          at org.apache.derby.impl.jdbc.SQLExceptionFactory40.getSQLException(Unknown Source)
          at org.apache.derby.impl.jdbc.Util.generateCsSQLException(Unknown Source)
          at org.apache.derby.impl.jdbc.TransactionResourceImpl.wrapInSQLException(Unknown Source)
          at org.apache.derby.impl.jdbc.TransactionResourceImpl.handleException(Unknown Source)
          at org.apache.derby.impl.jdbc.EmbedConnection.handleException(Unknown Source)
          at org.apache.derby.impl.jdbc.EmbedConnection.checkUserIsNotARole(Unknown Source)
          at org.apache.derby.impl.jdbc.EmbedConnection.checkUserCredentials(Unknown Source)
          at org.apache.derby.impl.jdbc.EmbedConnection.<init>(Unknown Source)
          at org.apache.derby.jdbc.Driver40.getNewEmbedConnection(Unknown Source)
          at org.apache.derby.jdbc.InternalDriver.connect(Unknown Source)
          at org.apache.derby.jdbc.AutoloadedDriver.connect(Unknown Source)
          at java.sql.DriverManager.getConnection(DriverManager.java:322)
          at java.sql.DriverManager.getConnection(DriverManager.java:297)
          at org.apache.derbyTesting.junit.DriverManagerConnector.openConnection(DriverManagerConnector.java:81)
          at org.apache.derbyTesting.junit.DriverManagerConnector.openConnection(DriverManagerConnector.java:43)
          at org.apache.derbyTesting.junit.TestConfiguration.openDefaultConnection(TestConfiguration.java:1574)
          at org.apache.derbyTesting.junit.BaseJDBCTestSetup.getConnection(BaseJDBCTestSetup.java:72)
          at org.apache.derbyTesting.junit.DatabasePropertyTestSetup.tearDown(DatabasePropertyTestSetup.java:288)
          at junit.extensions.TestSetup$1.protect(TestSetup.java:22)
          at junit.extensions.TestSetup.run(TestSetup.java:18)
          at org.apache.derbyTesting.junit.BaseTestSetup.run(BaseTestSetup.java:57)
          at junit.extensions.TestDecorator.basicRun(TestDecorator.java:24)
          at junit.extensions.TestSetup$1.protect(TestSetup.java:21)
          at junit.extensions.TestSetup.run(TestSetup.java:18)
          at junit.extensions.TestDecorator.basicRun(TestDecorator.java:24)
          at junit.extensions.TestSetup$1.protect(TestSetup.java:21)
          at junit.extensions.TestSetup.run(TestSetup.java:18)
          at org.apache.derbyTesting.junit.BaseTestSetup.run(BaseTestSetup.java:57)
          at junit.extensions.TestDecorator.basicRun(TestDecorator.java:24)
          at junit.extensions.TestSetup$1.protect(TestSetup.java:21)
          at junit.extensions.TestSetup.run(TestSetup.java:18)
          at org.apache.derbyTesting.junit.BaseTestSetup.run(BaseTestSetup.java:57)
          at junit.extensions.TestDecorator.basicRun(TestDecorator.java:24)
          at junit.extensions.TestSetup$1.protect(TestSetup.java:21)
          at junit.extensions.TestSetup.run(TestSetup.java:18)
          at junit.extensions.TestDecorator.basicRun(TestDecorator.java:24)
          at junit.extensions.TestSetup$1.protect(TestSetup.java:21)
          at junit.extensions.TestSetup.run(TestSetup.java:18)
          at org.apache.derbyTesting.junit.BaseTestSetup.run(BaseTestSetup.java:57)
          at junit.extensions.TestDecorator.basicRun(TestDecorator.java:24)
          at junit.extensions.TestSetup$1.protect(TestSetup.java:21)
          at junit.extensions.TestSetup.run(TestSetup.java:18)
          Caused by: java.sql.SQLException: Database connection refused.
          at org.apache.derby.impl.jdbc.SQLExceptionFactory.getSQLException(Unknown Source)
          at org.apache.derby.impl.jdbc.SQLExceptionFactory40.wrapArgsForTransportAcrossDRDA(Unknown Source)
          ... 62 more
          Caused by: ERROR 08004: Database connection refused.
          at org.apache.derby.iapi.error.StandardException.newException(Unknown Source)
          at org.apache.derby.impl.sql.conn.GenericAuthorizer.refresh(Unknown Source)
          at org.apache.derby.impl.sql.conn.GenericAuthorizer.<init>(Unknown Source)
          at org.apache.derby.impl.sql.conn.GenericLanguageConnectionContext.initialize(Unknown Source)
          at org.apache.derby.impl.db.BasicDatabase.setupConnection(Unknown Source)
          at org.apache.derby.impl.jdbc.TransactionResourceImpl.startTransaction(Unknown Source)
          ... 57 more
          3) testConnectShutdownAuthentication(org.apache.derbyTesting.functionTests.tests.jdbcapi.DriverMgrAuthenticationTest)java.sql.SQLNonTransientConnectionException: Database connection refused.
          at java.lang.Throwable.<init>(Throwable.java:80)
          at java.sql.SQLException.<init>(SQLException.java:153)
          at java.sql.SQLException.<init>(SQLException.java:176)
          at org.apache.derby.impl.jdbc.SQLExceptionFactory40.getSQLException(Unknown Source)
          at org.apache.derby.impl.jdbc.Util.generateCsSQLException(Unknown Source)
          at org.apache.derby.impl.jdbc.TransactionResourceImpl.wrapInSQLException(Unknown Source)
          at org.apache.derby.impl.jdbc.TransactionResourceImpl.handleException(Unknown Source)
          at org.apache.derby.impl.jdbc.EmbedConnection.handleException(Unknown Source)
          at org.apache.derby.impl.jdbc.EmbedConnection.checkUserIsNotARole(Unknown Source)
          at org.apache.derby.impl.jdbc.EmbedConnection.checkUserCredentials(Unknown Source)
          at org.apache.derby.impl.jdbc.EmbedConnection.<init>(Unknown Source)
          at org.apache.derby.jdbc.Driver40.getNewEmbedConnection(Unknown Source)
          at org.apache.derby.jdbc.InternalDriver.connect(Unknown Source)
          at org.apache.derby.jdbc.AutoloadedDriver.connect(Unknown Source)
          at java.sql.DriverManager.getConnection(DriverManager.java:322)
          at java.sql.DriverManager.getConnection(DriverManager.java:297)
          at org.apache.derbyTesting.junit.DriverManagerConnector.openConnection(DriverManagerConnector.java:81)
          at org.apache.derbyTesting.junit.DriverManagerConnector.openConnection(DriverManagerConnector.java:43)
          at org.apache.derbyTesting.junit.TestConfiguration.openDefaultConnection(TestConfiguration.java:1574)
          at org.apache.derbyTesting.junit.BaseJDBCTestSetup.getConnection(BaseJDBCTestSetup.java:72)
          at org.apache.derbyTesting.junit.DatabasePropertyTestSetup.tearDown(DatabasePropertyTestSetup.java:288)
          at junit.extensions.TestSetup$1.protect(TestSetup.java:22)
          at junit.extensions.TestSetup.run(TestSetup.java:18)
          at org.apache.derbyTesting.junit.BaseTestSetup.run(BaseTestSetup.java:57)
          at junit.extensions.TestDecorator.basicRun(TestDecorator.java:24)
          at junit.extensions.TestSetup$1.protect(TestSetup.java:21)
          at junit.extensions.TestSetup.run(TestSetup.java:18)
          at org.apache.derbyTesting.junit.BaseTestSetup.run(BaseTestSetup.java:57)
          at junit.extensions.TestDecorator.basicRun(TestDecorator.java:24)
          at junit.extensions.TestSetup$1.protect(TestSetup.java:21)
          at junit.extensions.TestSetup.run(TestSetup.java:18)
          at junit.extensions.TestDecorator.basicRun(TestDecorator.java:24)
          at junit.extensions.TestSetup$1.protect(TestSetup.java:21)
          at junit.extensions.TestSetup.run(TestSetup.java:18)
          at org.apache.derbyTesting.junit.BaseTestSetup.run(BaseTestSetup.java:57)
          at junit.extensions.TestDecorator.basicRun(TestDecorator.java:24)
          at junit.extensions.TestSetup$1.protect(TestSetup.java:21)
          at junit.extensions.TestSetup.run(TestSetup.java:18)
          Caused by: java.sql.SQLException: Database connection refused.
          at org.apache.derby.impl.jdbc.SQLExceptionFactory.getSQLException(Unknown Source)
          at org.apache.derby.impl.jdbc.SQLExceptionFactory40.wrapArgsForTransportAcrossDRDA(Unknown Source)
          ... 53 more
          Caused by: ERROR 08004: Database connection refused.
          at org.apache.derby.iapi.error.StandardException.newException(Unknown Source)
          at org.apache.derby.impl.sql.conn.GenericAuthorizer.refresh(Unknown Source)
          at org.apache.derby.impl.sql.conn.GenericAuthorizer.<init>(Unknown Source)
          at org.apache.derby.impl.sql.conn.GenericLanguageConnectionContext.initialize(Unknown Source)
          at org.apache.derby.impl.db.BasicDatabase.setupConnection(Unknown Source)
          at org.apache.derby.impl.jdbc.TransactionResourceImpl.startTransaction(Unknown Source)
          ... 48 more
          4) testConnectShutdownAuthentication(org.apache.derbyTesting.functionTests.tests.jdbcapi.DriverMgrAuthenticationTest)java.sql.SQLNonTransientConnectionException: Database connection refused.
          at java.lang.Throwable.<init>(Throwable.java:80)
          at java.sql.SQLException.<init>(SQLException.java:153)
          at java.sql.SQLException.<init>(SQLException.java:176)
          at org.apache.derby.impl.jdbc.SQLExceptionFactory40.getSQLException(Unknown Source)
          at org.apache.derby.impl.jdbc.Util.generateCsSQLException(Unknown Source)
          at org.apache.derby.impl.jdbc.TransactionResourceImpl.wrapInSQLException(Unknown Source)
          at org.apache.derby.impl.jdbc.TransactionResourceImpl.handleException(Unknown Source)
          at org.apache.derby.impl.jdbc.EmbedConnection.handleException(Unknown Source)
          at org.apache.derby.impl.jdbc.EmbedConnection.checkUserIsNotARole(Unknown Source)
          at org.apache.derby.impl.jdbc.EmbedConnection.checkUserCredentials(Unknown Source)
          at org.apache.derby.impl.jdbc.EmbedConnection.<init>(Unknown Source)
          at org.apache.derby.jdbc.Driver40.getNewEmbedConnection(Unknown Source)
          at org.apache.derby.jdbc.InternalDriver.connect(Unknown Source)
          at org.apache.derby.jdbc.AutoloadedDriver.connect(Unknown Source)
          at java.sql.DriverManager.getConnection(DriverManager.java:322)
          at java.sql.DriverManager.getConnection(DriverManager.java:297)
          at org.apache.derbyTesting.junit.DriverManagerConnector.openConnection(DriverManagerConnector.java:81)
          at org.apache.derbyTesting.junit.DriverManagerConnector.openConnection(DriverManagerConnector.java:43)
          at org.apache.derbyTesting.junit.TestConfiguration.openDefaultConnection(TestConfiguration.java:1574)
          at org.apache.derbyTesting.junit.BaseJDBCTestSetup.getConnection(BaseJDBCTestSetup.java:72)
          at org.apache.derbyTesting.junit.DatabasePropertyTestSetup.tearDown(DatabasePropertyTestSetup.java:288)
          at junit.extensions.TestSetup$1.protect(TestSetup.java:22)
          at junit.extensions.TestSetup.run(TestSetup.java:18)
          at org.apache.derbyTesting.junit.BaseTestSetup.run(BaseTestSetup.java:57)
          at junit.extensions.TestDecorator.basicRun(TestDecorator.java:24)
          at junit.extensions.TestSetup$1.protect(TestSetup.java:21)
          at junit.extensions.TestSetup.run(TestSetup.java:18)
          at junit.extensions.TestDecorator.basicRun(TestDecorator.java:24)
          at junit.extensions.TestSetup$1.protect(TestSetup.java:21)
          at junit.extensions.TestSetup.run(TestSetup.java:18)
          at org.apache.derbyTesting.junit.BaseTestSetup.run(BaseTestSetup.java:57)
          at junit.extensions.TestDecorator.basicRun(TestDecorator.java:24)
          at junit.extensions.TestSetup$1.protect(TestSetup.java:21)
          at junit.extensions.TestSetup.run(TestSetup.java:18)
          Caused by: java.sql.SQLException: Database connection refused.
          at org.apache.derby.impl.jdbc.SQLExceptionFactory.getSQLException(Unknown Source)
          at org.apache.derby.impl.jdbc.SQLExceptionFactory40.wrapArgsForTransportAcrossDRDA(Unknown Source)
          ... 48 more
          Caused by: ERROR 08004: Database connection refused.
          at org.apache.derby.iapi.error.StandardException.newException(Unknown Source)
          at org.apache.derby.impl.sql.conn.GenericAuthorizer.refresh(Unknown Source)
          at org.apache.derby.impl.sql.conn.GenericAuthorizer.<init>(Unknown Source)
          at org.apache.derby.impl.sql.conn.GenericLanguageConnectionContext.initialize(Unknown Source)
          at org.apache.derby.impl.db.BasicDatabase.setupConnection(Unknown Source)
          at org.apache.derby.impl.jdbc.TransactionResourceImpl.startTransaction(Unknown Source)
          ... 43 more
          5) testUserFunctions(org.apache.derbyTesting.functionTests.tests.jdbcapi.DriverMgrAuthenticationTest)java.sql.SQLNonTransientConnectionException: Database connection refused.
          at java.lang.Throwable.<init>(Throwable.java:80)
          at java.sql.SQLException.<init>(SQLException.java:153)
          at java.sql.SQLException.<init>(SQLException.java:176)
          at org.apache.derby.impl.jdbc.SQLExceptionFactory40.getSQLException(Unknown Source)
          at org.apache.derby.impl.jdbc.Util.generateCsSQLException(Unknown Source)
          at org.apache.derby.impl.jdbc.TransactionResourceImpl.wrapInSQLException(Unknown Source)
          at org.apache.derby.impl.jdbc.TransactionResourceImpl.handleException(Unknown Source)
          at org.apache.derby.impl.jdbc.EmbedConnection.handleException(Unknown Source)
          at org.apache.derby.impl.jdbc.EmbedConnection.checkUserIsNotARole(Unknown Source)
          at org.apache.derby.impl.jdbc.EmbedConnection.checkUserCredentials(Unknown Source)
          at org.apache.derby.impl.jdbc.EmbedConnection.<init>(Unknown Source)
          at org.apache.derby.jdbc.Driver40.getNewEmbedConnection(Unknown Source)
          at org.apache.derby.jdbc.InternalDriver.connect(Unknown Source)
          at org.apache.derby.jdbc.AutoloadedDriver.connect(Unknown Source)
          at java.sql.DriverManager.getConnection(DriverManager.java:322)
          at java.sql.DriverManager.getConnection(DriverManager.java:297)
          at org.apache.derbyTesting.junit.DriverManagerConnector.openConnection(DriverManagerConnector.java:81)
          at org.apache.derbyTesting.junit.DriverManagerConnector.openConnection(DriverManagerConnector.java:43)
          at org.apache.derbyTesting.junit.TestConfiguration.openDefaultConnection(TestConfiguration.java:1574)
          at org.apache.derbyTesting.junit.BaseJDBCTestSetup.getConnection(BaseJDBCTestSetup.java:72)
          at org.apache.derbyTesting.junit.DatabasePropertyTestSetup.setProperties(DatabasePropertyTestSetup.java:322)
          at org.apache.derbyTesting.junit.DatabasePropertyTestSetup.setUp(DatabasePropertyTestSetup.java:268)
          at junit.extensions.TestSetup$1.protect(TestSetup.java:20)
          at junit.extensions.TestSetup.run(TestSetup.java:18)
          at org.apache.derbyTesting.junit.BaseTestSetup.run(BaseTestSetup.java:57)
          at junit.extensions.TestDecorator.basicRun(TestDecorator.java:24)
          at junit.extensions.TestSetup$1.protect(TestSetup.java:21)
          at junit.extensions.TestSetup.run(TestSetup.java:18)
          at junit.extensions.TestDecorator.basicRun(TestDecorator.java:24)
          at junit.extensions.TestSetup$1.protect(TestSetup.java:21)
          at junit.extensions.TestSetup.run(TestSetup.java:18)
          at org.apache.derbyTesting.junit.BaseTestSetup.run(BaseTestSetup.java:57)
          at junit.extensions.TestDecorator.basicRun(TestDecorator.java:24)
          at junit.extensions.TestSetup$1.protect(TestSetup.java:21)
          at junit.extensions.TestSetup.run(TestSetup.java:18)
          Caused by: java.sql.SQLException: Database connection refused.
          at org.apache.derby.impl.jdbc.SQLExceptionFactory.getSQLException(Unknown Source)
          at org.apache.derby.impl.jdbc.SQLExceptionFactory40.wrapArgsForTransportAcrossDRDA(Unknown Source)
          ... 49 more
          Caused by: ERROR 08004: Database connection refused.
          at org.apache.derby.iapi.error.StandardException.newException(Unknown Source)
          at org.apache.derby.impl.sql.conn.GenericAuthorizer.refresh(Unknown Source)
          at org.apache.derby.impl.sql.conn.GenericAuthorizer.<init>(Unknown Source)
          at org.apache.derby.impl.sql.conn.GenericLanguageConnectionContext.initialize(Unknown Source)
          at org.apache.derby.impl.db.BasicDatabase.setupConnection(Unknown Source)
          at org.apache.derby.impl.jdbc.TransactionResourceImpl.startTransaction(Unknown Source)
          ... 44 more
          6) testNotFullAccessUsers(org.apache.derbyTesting.functionTests.tests.jdbcapi.DriverMgrAuthenticationTest)java.sql.SQLNonTransientConnectionException: Database connection refused.
          at java.lang.Throwable.<init>(Throwable.java:80)
          at java.sql.SQLException.<init>(SQLException.java:153)
          at java.sql.SQLException.<init>(SQLException.java:176)
          at org.apache.derby.impl.jdbc.SQLExceptionFactory40.getSQLException(Unknown Source)
          at org.apache.derby.impl.jdbc.Util.generateCsSQLException(Unknown Source)
          at org.apache.derby.impl.jdbc.TransactionResourceImpl.wrapInSQLException(Unknown Source)
          at org.apache.derby.impl.jdbc.TransactionResourceImpl.handleException(Unknown Source)
          at org.apache.derby.impl.jdbc.EmbedConnection.handleException(Unknown Source)
          at org.apache.derby.impl.jdbc.EmbedConnection.checkUserIsNotARole(Unknown Source)
          at org.apache.derby.impl.jdbc.EmbedConnection.checkUserCredentials(Unknown Source)
          at org.apache.derby.impl.jdbc.EmbedConnection.<init>(Unknown Source)
          at org.apache.derby.jdbc.Driver40.getNewEmbedConnection(Unknown Source)
          at org.apache.derby.jdbc.InternalDriver.connect(Unknown Source)
          at org.apache.derby.jdbc.AutoloadedDriver.connect(Unknown Source)
          at java.sql.DriverManager.getConnection(DriverManager.java:322)
          at java.sql.DriverManager.getConnection(DriverManager.java:297)
          at org.apache.derbyTesting.junit.DriverManagerConnector.openConnection(DriverManagerConnector.java:81)
          at org.apache.derbyTesting.junit.DriverManagerConnector.openConnection(DriverManagerConnector.java:43)
          at org.apache.derbyTesting.junit.TestConfiguration.openDefaultConnection(TestConfiguration.java:1574)
          at org.apache.derbyTesting.junit.BaseJDBCTestSetup.getConnection(BaseJDBCTestSetup.java:72)
          at org.apache.derbyTesting.junit.DatabasePropertyTestSetup.setProperties(DatabasePropertyTestSetup.java:322)
          at org.apache.derbyTesting.junit.DatabasePropertyTestSetup.setUp(DatabasePropertyTestSetup.java:268)
          at junit.extensions.TestSetup$1.protect(TestSetup.java:20)
          at junit.extensions.TestSetup.run(TestSetup.java:18)
          at org.apache.derbyTesting.junit.BaseTestSetup.run(BaseTestSetup.java:57)
          at junit.extensions.TestDecorator.basicRun(TestDecorator.java:24)
          at junit.extensions.TestSetup$1.protect(TestSetup.java:21)
          at junit.extensions.TestSetup.run(TestSetup.java:18)
          at junit.extensions.TestDecorator.basicRun(TestDecorator.java:24)
          at junit.extensions.TestSetup$1.protect(TestSetup.java:21)
          at junit.extensions.TestSetup.run(TestSetup.java:18)
          at org.apache.derbyTesting.junit.BaseTestSetup.run(BaseTestSetup.java:57)
          at junit.extensions.TestDecorator.basicRun(TestDecorator.java:24)
          at junit.extensions.TestSetup$1.protect(TestSetup.java:21)
          at junit.extensions.TestSetup.run(TestSetup.java:18)
          Caused by: java.sql.SQLException: Database connection refused.
          at org.apache.derby.impl.jdbc.SQLExceptionFactory.getSQLException(Unknown Source)
          at org.apache.derby.impl.jdbc.SQLExceptionFactory40.wrapArgsForTransportAcrossDRDA(Unknown Source)
          ... 49 more
          Caused by: ERROR 08004: Database connection refused.
          at org.apache.derby.iapi.error.StandardException.newException(Unknown Source)
          at org.apache.derby.impl.sql.conn.GenericAuthorizer.refresh(Unknown Source)
          at org.apache.derby.impl.sql.conn.GenericAuthorizer.<init>(Unknown Source)
          at org.apache.derby.impl.sql.conn.GenericLanguageConnectionContext.initialize(Unknown Source)
          at org.apache.derby.impl.db.BasicDatabase.setupConnection(Unknown Source)
          at org.apache.derby.impl.jdbc.TransactionResourceImpl.startTransaction(Unknown Source)
          ... 44 more
          7) testChangePasswordAndDatabasePropertiesOnly(org.apache.derbyTesting.functionTests.tests.jdbcapi.DriverMgrAuthenticationTest)java.sql.SQLNonTransientConnectionException: Database connection refused.
          at java.lang.Throwable.<init>(Throwable.java:80)
          at java.sql.SQLException.<init>(SQLException.java:153)
          at java.sql.SQLException.<init>(SQLException.java:176)
          at org.apache.derby.impl.jdbc.SQLExceptionFactory40.getSQLException(Unknown Source)
          at org.apache.derby.impl.jdbc.Util.generateCsSQLException(Unknown Source)
          at org.apache.derby.impl.jdbc.TransactionResourceImpl.wrapInSQLException(Unknown Source)
          at org.apache.derby.impl.jdbc.TransactionResourceImpl.handleException(Unknown Source)
          at org.apache.derby.impl.jdbc.EmbedConnection.handleException(Unknown Source)
          at org.apache.derby.impl.jdbc.EmbedConnection.checkUserIsNotARole(Unknown Source)
          at org.apache.derby.impl.jdbc.EmbedConnection.checkUserCredentials(Unknown Source)
          at org.apache.derby.impl.jdbc.EmbedConnection.<init>(Unknown Source)
          at org.apache.derby.jdbc.Driver40.getNewEmbedConnection(Unknown Source)
          at org.apache.derby.jdbc.InternalDriver.connect(Unknown Source)
          at org.apache.derby.jdbc.AutoloadedDriver.connect(Unknown Source)
          at java.sql.DriverManager.getConnection(DriverManager.java:322)
          at java.sql.DriverManager.getConnection(DriverManager.java:297)
          at org.apache.derbyTesting.junit.DriverManagerConnector.openConnection(DriverManagerConnector.java:81)
          at org.apache.derbyTesting.junit.DriverManagerConnector.openConnection(DriverManagerConnector.java:43)
          at org.apache.derbyTesting.junit.TestConfiguration.openDefaultConnection(TestConfiguration.java:1574)
          at org.apache.derbyTesting.junit.BaseJDBCTestSetup.getConnection(BaseJDBCTestSetup.java:72)
          at org.apache.derbyTesting.junit.DatabasePropertyTestSetup.setProperties(DatabasePropertyTestSetup.java:322)
          at org.apache.derbyTesting.junit.DatabasePropertyTestSetup.setUp(DatabasePropertyTestSetup.java:268)
          at junit.extensions.TestSetup$1.protect(TestSetup.java:20)
          at junit.extensions.TestSetup.run(TestSetup.java:18)
          at org.apache.derbyTesting.junit.BaseTestSetup.run(BaseTestSetup.java:57)
          at junit.extensions.TestDecorator.basicRun(TestDecorator.java:24)
          at junit.extensions.TestSetup$1.protect(TestSetup.java:21)
          at junit.extensions.TestSetup.run(TestSetup.java:18)
          at junit.extensions.TestDecorator.basicRun(TestDecorator.java:24)
          at junit.extensions.TestSetup$1.protect(TestSetup.java:21)
          at junit.extensions.TestSetup.run(TestSetup.java:18)
          at org.apache.derbyTesting.junit.BaseTestSetup.run(BaseTestSetup.java:57)
          at junit.extensions.TestDecorator.basicRun(TestDecorator.java:24)
          at junit.extensions.TestSetup$1.protect(TestSetup.java:21)
          at junit.extensions.TestSetup.run(TestSetup.java:18)
          Caused by: java.sql.SQLException: Database connection refused.
          at org.apache.derby.impl.jdbc.SQLExceptionFactory.getSQLException(Unknown Source)
          at org.apache.derby.impl.jdbc.SQLExceptionFactory40.wrapArgsForTransportAcrossDRDA(Unknown Source)
          ... 49 more
          Caused by: ERROR 08004: Database connection refused.
          at org.apache.derby.iapi.error.StandardException.newException(Unknown Source)
          at org.apache.derby.impl.sql.conn.GenericAuthorizer.refresh(Unknown Source)
          at org.apache.derby.impl.sql.conn.GenericAuthorizer.<init>(Unknown Source)
          at org.apache.derby.impl.sql.conn.GenericLanguageConnectionContext.initialize(Unknown Source)
          at org.apache.derby.impl.db.BasicDatabase.setupConnection(Unknown Source)
          at org.apache.derby.impl.jdbc.TransactionResourceImpl.startTransaction(Unknown Source)
          ... 44 more
          8) testGreekCharacters(org.apache.derbyTesting.functionTests.tests.jdbcapi.DriverMgrAuthenticationTest)java.sql.SQLNonTransientConnectionException: Database connection refused.
          at java.lang.Throwable.<init>(Throwable.java:80)
          at java.sql.SQLException.<init>(SQLException.java:153)
          at java.sql.SQLException.<init>(SQLException.java:176)
          at org.apache.derby.impl.jdbc.SQLExceptionFactory40.getSQLException(Unknown Source)
          at org.apache.derby.impl.jdbc.Util.generateCsSQLException(Unknown Source)
          at org.apache.derby.impl.jdbc.TransactionResourceImpl.wrapInSQLException(Unknown Source)
          at org.apache.derby.impl.jdbc.TransactionResourceImpl.handleException(Unknown Source)
          at org.apache.derby.impl.jdbc.EmbedConnection.handleException(Unknown Source)
          at org.apache.derby.impl.jdbc.EmbedConnection.checkUserIsNotARole(Unknown Source)
          at org.apache.derby.impl.jdbc.EmbedConnection.checkUserCredentials(Unknown Source)
          at org.apache.derby.impl.jdbc.EmbedConnection.<init>(Unknown Source)
          at org.apache.derby.jdbc.Driver40.getNewEmbedConnection(Unknown Source)
          at org.apache.derby.jdbc.InternalDriver.connect(Unknown Source)
          at org.apache.derby.jdbc.AutoloadedDriver.connect(Unknown Source)
          at java.sql.DriverManager.getConnection(DriverManager.java:322)
          at java.sql.DriverManager.getConnection(DriverManager.java:297)
          at org.apache.derbyTesting.junit.DriverManagerConnector.openConnection(DriverManagerConnector.java:81)
          at org.apache.derbyTesting.junit.DriverManagerConnector.openConnection(DriverManagerConnector.java:43)
          at org.apache.derbyTesting.junit.TestConfiguration.openDefaultConnection(TestConfiguration.java:1574)
          at org.apache.derbyTesting.junit.BaseJDBCTestSetup.getConnection(BaseJDBCTestSetup.java:72)
          at org.apache.derbyTesting.junit.DatabasePropertyTestSetup.setProperties(DatabasePropertyTestSetup.java:322)
          at org.apache.derbyTesting.junit.DatabasePropertyTestSetup.setUp(DatabasePropertyTestSetup.java:268)
          at junit.extensions.TestSetup$1.protect(TestSetup.java:20)
          at junit.extensions.TestSetup.run(TestSetup.java:18)
          at org.apache.derbyTesting.junit.BaseTestSetup.run(BaseTestSetup.java:57)
          at junit.extensions.TestDecorator.basicRun(TestDecorator.java:24)
          at junit.extensions.TestSetup$1.protect(TestSetup.java:21)
          at junit.extensions.TestSetup.run(TestSetup.java:18)
          at junit.extensions.TestDecorator.basicRun(TestDecorator.java:24)
          at junit.extensions.TestSetup$1.protect(TestSetup.java:21)
          at junit.extensions.TestSetup.run(TestSetup.java:18)
          at org.apache.derbyTesting.junit.BaseTestSetup.run(BaseTestSetup.java:57)
          at junit.extensions.TestDecorator.basicRun(TestDecorator.java:24)
          at junit.extensions.TestSetup$1.protect(TestSetup.java:21)
          at junit.extensions.TestSetup.run(TestSetup.java:18)
          Caused by: java.sql.SQLException: Database connection refused.
          at org.apache.derby.impl.jdbc.SQLExceptionFactory.getSQLException(Unknown Source)
          at org.apache.derby.impl.jdbc.SQLExceptionFactory40.wrapArgsForTransportAcrossDRDA(Unknown Source)
          ... 49 more
          Caused by: ERROR 08004: Database connection refused.
          at org.apache.derby.iapi.error.StandardException.newException(Unknown Source)
          at org.apache.derby.impl.sql.conn.GenericAuthorizer.refresh(Unknown Source)
          at org.apache.derby.impl.sql.conn.GenericAuthorizer.<init>(Unknown Source)
          at org.apache.derby.impl.sql.conn.GenericLanguageConnectionContext.initialize(Unknown Source)
          at org.apache.derby.impl.db.BasicDatabase.setupConnection(Unknown Source)
          at org.apache.derby.impl.jdbc.TransactionResourceImpl.startTransaction(Unknown Source)
          ... 44 more
          9) testSystemShutdown(org.apache.derbyTesting.functionTests.tests.jdbcapi.DriverMgrAuthenticationTest)java.sql.SQLNonTransientConnectionException: Database connection refused.
          at java.lang.Throwable.<init>(Throwable.java:80)
          at java.sql.SQLException.<init>(SQLException.java:153)
          at java.sql.SQLException.<init>(SQLException.java:176)
          at org.apache.derby.impl.jdbc.SQLExceptionFactory40.getSQLException(Unknown Source)
          at org.apache.derby.impl.jdbc.Util.generateCsSQLException(Unknown Source)
          at org.apache.derby.impl.jdbc.TransactionResourceImpl.wrapInSQLException(Unknown Source)
          at org.apache.derby.impl.jdbc.TransactionResourceImpl.handleException(Unknown Source)
          at org.apache.derby.impl.jdbc.EmbedConnection.handleException(Unknown Source)
          at org.apache.derby.impl.jdbc.EmbedConnection.checkUserIsNotARole(Unknown Source)
          at org.apache.derby.impl.jdbc.EmbedConnection.checkUserCredentials(Unknown Source)
          at org.apache.derby.impl.jdbc.EmbedConnection.<init>(Unknown Source)
          at org.apache.derby.jdbc.Driver40.getNewEmbedConnection(Unknown Source)
          at org.apache.derby.jdbc.InternalDriver.connect(Unknown Source)
          at org.apache.derby.jdbc.AutoloadedDriver.connect(Unknown Source)
          at java.sql.DriverManager.getConnection(DriverManager.java:322)
          at java.sql.DriverManager.getConnection(DriverManager.java:297)
          at org.apache.derbyTesting.junit.DriverManagerConnector.openConnection(DriverManagerConnector.java:81)
          at org.apache.derbyTesting.junit.DriverManagerConnector.openConnection(DriverManagerConnector.java:43)
          at org.apache.derbyTesting.junit.TestConfiguration.openDefaultConnection(TestConfiguration.java:1574)
          at org.apache.derbyTesting.junit.BaseJDBCTestSetup.getConnection(BaseJDBCTestSetup.java:72)
          at org.apache.derbyTesting.junit.DatabasePropertyTestSetup.setProperties(DatabasePropertyTestSetup.java:322)
          at org.apache.derbyTesting.junit.DatabasePropertyTestSetup.setUp(DatabasePropertyTestSetup.java:268)
          at junit.extensions.TestSetup$1.protect(TestSetup.java:20)
          at junit.extensions.TestSetup.run(TestSetup.java:18)
          at org.apache.derbyTesting.junit.BaseTestSetup.run(BaseTestSetup.java:57)
          at junit.extensions.TestDecorator.basicRun(TestDecorator.java:24)
          at junit.extensions.TestSetup$1.protect(TestSetup.java:21)
          at junit.extensions.TestSetup.run(TestSetup.java:18)
          at junit.extensions.TestDecorator.basicRun(TestDecorator.java:24)
          at junit.extensions.TestSetup$1.protect(TestSetup.java:21)
          at junit.extensions.TestSetup.run(TestSetup.java:18)
          at org.apache.derbyTesting.junit.BaseTestSetup.run(BaseTestSetup.java:57)
          at junit.extensions.TestDecorator.basicRun(TestDecorator.java:24)
          at junit.extensions.TestSetup$1.protect(TestSetup.java:21)
          at junit.extensions.TestSetup.run(TestSetup.java:18)
          Caused by: java.sql.SQLException: Database connection refused.
          at org.apache.derby.impl.jdbc.SQLExceptionFactory.getSQLException(Unknown Source)
          at org.apache.derby.impl.jdbc.SQLExceptionFactory40.wrapArgsForTransportAcrossDRDA(Unknown Source)
          ... 49 more
          Caused by: ERROR 08004: Database connection refused.
          at org.apache.derby.iapi.error.StandardException.newException(Unknown Source)
          at org.apache.derby.impl.sql.conn.GenericAuthorizer.refresh(Unknown Source)
          at org.apache.derby.impl.sql.conn.GenericAuthorizer.<init>(Unknown Source)
          at org.apache.derby.impl.sql.conn.GenericLanguageConnectionContext.initialize(Unknown Source)
          at org.apache.derby.impl.db.BasicDatabase.setupConnection(Unknown Source)
          at org.apache.derby.impl.jdbc.TransactionResourceImpl.startTransaction(Unknown Source)
          ... 44 more
          10) DriverMgrAuthenticationTestjava.sql.SQLNonTransientConnectionException: Database connection refused.
          at java.lang.Throwable.<init>(Throwable.java:80)
          at java.sql.SQLException.<init>(SQLException.java:153)
          at java.sql.SQLException.<init>(SQLException.java:176)
          at org.apache.derby.impl.jdbc.SQLExceptionFactory40.getSQLException(Unknown Source)
          at org.apache.derby.impl.jdbc.Util.generateCsSQLException(Unknown Source)
          at org.apache.derby.impl.jdbc.TransactionResourceImpl.wrapInSQLException(Unknown Source)
          at org.apache.derby.impl.jdbc.TransactionResourceImpl.handleException(Unknown Source)
          at org.apache.derby.impl.jdbc.EmbedConnection.handleException(Unknown Source)
          at org.apache.derby.impl.jdbc.EmbedConnection.checkUserIsNotARole(Unknown Source)
          at org.apache.derby.impl.jdbc.EmbedConnection.checkUserCredentials(Unknown Source)
          at org.apache.derby.impl.jdbc.EmbedConnection.<init>(Unknown Source)
          at org.apache.derby.jdbc.Driver40.getNewEmbedConnection(Unknown Source)
          at org.apache.derby.jdbc.InternalDriver.connect(Unknown Source)
          at org.apache.derby.jdbc.AutoloadedDriver.connect(Unknown Source)
          at java.sql.DriverManager.getConnection(DriverManager.java:322)
          at java.sql.DriverManager.getConnection(DriverManager.java:297)
          at org.apache.derbyTesting.junit.DriverManagerConnector.openConnection(DriverManagerConnector.java:81)
          at org.apache.derbyTesting.junit.DriverManagerConnector.openConnection(DriverManagerConnector.java:47)
          at org.apache.derbyTesting.junit.TestConfiguration.openConnection(TestConfiguration.java:1603)
          at org.apache.derbyTesting.junit.DropDatabaseSetup.tearDown(DropDatabaseSetup.java:54)
          at junit.extensions.TestSetup$1.protect(TestSetup.java:22)
          at junit.extensions.TestSetup.run(TestSetup.java:18)
          at org.apache.derbyTesting.junit.BaseTestSetup.run(BaseTestSetup.java:57)
          at junit.extensions.TestDecorator.basicRun(TestDecorator.java:24)
          at junit.extensions.TestSetup$1.protect(TestSetup.java:21)
          at junit.extensions.TestSetup.run(TestSetup.java:18)
          Caused by: java.sql.SQLException: Database connection refused.
          at org.apache.derby.impl.jdbc.SQLExceptionFactory.getSQLException(Unknown Source)
          at org.apache.derby.impl.jdbc.SQLExceptionFactory40.wrapArgsForTransportAcrossDRDA(Unknown Source)
          ... 36 more
          Caused by: ERROR 08004: Database connection refused.
          at org.apache.derby.iapi.error.StandardException.newException(Unknown Source)
          at org.apache.derby.impl.sql.conn.GenericAuthorizer.refresh(Unknown Source)
          at org.apache.derby.impl.sql.conn.GenericAuthorizer.<init>(Unknown Source)
          at org.apache.derby.impl.sql.conn.GenericLanguageConnectionContext.initialize(Unknown Source)
          at org.apache.derby.impl.db.BasicDatabase.setupConnection(Unknown Source)
          at org.apache.derby.impl.jdbc.TransactionResourceImpl.startTransaction(Unknown Source)
          ... 31 more

          Show
          Mike Matrigali added a comment - errors from following build: http://people.apache.org/~myrnavl/derby_test_results/main/windows/testlog/ibm16/1230376-suites.All_diff.txt 1) testConnectShutdownAuthentication(org.apache.derbyTesting.functionTests.tests.jdbcapi.DriverMgrAuthenticationTest)java.sql.SQLException: An SQL data change is not permitted for a read-only connection, user or database. at java.lang.Throwable.<init>(Throwable.java:80) at java.sql.SQLException.<init>(SQLException.java:153) at java.sql.SQLException.<init>(SQLException.java:176) at org.apache.derby.impl.jdbc.SQLExceptionFactory40.getSQLException(Unknown Source) at org.apache.derby.impl.jdbc.Util.generateCsSQLException(Unknown Source) at org.apache.derby.impl.jdbc.TransactionResourceImpl.wrapInSQLException(Unknown Source) at org.apache.derby.impl.jdbc.TransactionResourceImpl.handleException(Unknown Source) at org.apache.derby.impl.jdbc.EmbedConnection.handleException(Unknown Source) at org.apache.derby.impl.jdbc.ConnectionChild.handleException(Unknown Source) at org.apache.derby.impl.jdbc.EmbedStatement.executeStatement(Unknown Source) at org.apache.derby.impl.jdbc.EmbedPreparedStatement.executeStatement(Unknown Source) at org.apache.derby.impl.jdbc.EmbedCallableStatement.executeStatement(Unknown Source) at org.apache.derby.impl.jdbc.EmbedPreparedStatement.execute(Unknown Source) at org.apache.derbyTesting.functionTests.tests.jdbcapi.AuthenticationTest.setDatabaseProperty(AuthenticationTest.java:1297) at org.apache.derbyTesting.functionTests.tests.jdbcapi.AuthenticationTest.testConnectShutdownAuthentication(AuthenticationTest.java:512) at sun.reflect.NativeMethodAccessorImpl.invoke0(Native Method) at sun.reflect.NativeMethodAccessorImpl.invoke(NativeMethodAccessorImpl.java:60) at sun.reflect.DelegatingMethodAccessorImpl.invoke(DelegatingMethodAccessorImpl.java:37) at org.apache.derbyTesting.junit.BaseTestCase.runBare(BaseTestCase.java:116) at junit.extensions.TestDecorator.basicRun(TestDecorator.java:24) at junit.extensions.TestSetup$1.protect(TestSetup.java:21) at junit.extensions.TestSetup.run(TestSetup.java:18) at org.apache.derbyTesting.junit.BaseTestSetup.run(BaseTestSetup.java:57) at junit.extensions.TestDecorator.basicRun(TestDecorator.java:24) at junit.extensions.TestSetup$1.protect(TestSetup.java:21) at junit.extensions.TestSetup.run(TestSetup.java:18) at junit.extensions.TestDecorator.basicRun(TestDecorator.java:24) at junit.extensions.TestSetup$1.protect(TestSetup.java:21) at junit.extensions.TestSetup.run(TestSetup.java:18) at org.apache.derbyTesting.junit.BaseTestSetup.run(BaseTestSetup.java:57) at junit.extensions.TestDecorator.basicRun(TestDecorator.java:24) at junit.extensions.TestSetup$1.protect(TestSetup.java:21) at junit.extensions.TestSetup.run(TestSetup.java:18) at org.apache.derbyTesting.junit.BaseTestSetup.run(BaseTestSetup.java:57) at junit.extensions.TestDecorator.basicRun(TestDecorator.java:24) at junit.extensions.TestSetup$1.protect(TestSetup.java:21) at junit.extensions.TestSetup.run(TestSetup.java:18) at junit.extensions.TestDecorator.basicRun(TestDecorator.java:24) at junit.extensions.TestSetup$1.protect(TestSetup.java:21) at junit.extensions.TestSetup.run(TestSetup.java:18) at org.apache.derbyTesting.junit.BaseTestSetup.run(BaseTestSetup.java:57) at junit.extensions.TestDecorator.basicRun(TestDecorator.java:24) at junit.extensions.TestSetup$1.protect(TestSetup.java:21) at junit.extensions.TestSetup.run(TestSetup.java:18) Caused by: java.sql.SQLException: An SQL data change is not permitted for a read-only connection, user or database. at org.apache.derby.impl.jdbc.SQLExceptionFactory.getSQLException(Unknown Source) at org.apache.derby.impl.jdbc.SQLExceptionFactory40.wrapArgsForTransportAcrossDRDA(Unknown Source) ... 68 more Caused by: ERROR 25502: An SQL data change is not permitted for a read-only connection, user or database. at org.apache.derby.iapi.error.StandardException.newException(Unknown Source) at org.apache.derby.impl.sql.conn.GenericAuthorizer.authorize(Unknown Source) at org.apache.derby.exe.ac2bd9f4bdx0134xd201x1a93xffffc6d89d380.g0(Unknown Source) at sun.reflect.NativeMethodAccessorImpl.invoke0(Native Method) at sun.reflect.NativeMethodAccessorImpl.invoke(NativeMethodAccessorImpl.java:60) at sun.reflect.DelegatingMethodAccessorImpl.invoke(DelegatingMethodAccessorImpl.java:37) at org.apache.derby.impl.services.reflect.ReflectMethod.invoke(Unknown Source) at org.apache.derby.impl.sql.execute.CallStatementResultSet.open(Unknown Source) at org.apache.derby.impl.sql.GenericPreparedStatement.executeStmt(Unknown Source) at org.apache.derby.impl.sql.GenericPreparedStatement.execute(Unknown Source) ... 62 more 2) testConnectShutdownAuthentication(org.apache.derbyTesting.functionTests.tests.jdbcapi.DriverMgrAuthenticationTest)java.sql.SQLNonTransientConnectionException: Database connection refused. at java.lang.Throwable.<init>(Throwable.java:80) at java.sql.SQLException.<init>(SQLException.java:153) at java.sql.SQLException.<init>(SQLException.java:176) at org.apache.derby.impl.jdbc.SQLExceptionFactory40.getSQLException(Unknown Source) at org.apache.derby.impl.jdbc.Util.generateCsSQLException(Unknown Source) at org.apache.derby.impl.jdbc.TransactionResourceImpl.wrapInSQLException(Unknown Source) at org.apache.derby.impl.jdbc.TransactionResourceImpl.handleException(Unknown Source) at org.apache.derby.impl.jdbc.EmbedConnection.handleException(Unknown Source) at org.apache.derby.impl.jdbc.EmbedConnection.checkUserIsNotARole(Unknown Source) at org.apache.derby.impl.jdbc.EmbedConnection.checkUserCredentials(Unknown Source) at org.apache.derby.impl.jdbc.EmbedConnection.<init>(Unknown Source) at org.apache.derby.jdbc.Driver40.getNewEmbedConnection(Unknown Source) at org.apache.derby.jdbc.InternalDriver.connect(Unknown Source) at org.apache.derby.jdbc.AutoloadedDriver.connect(Unknown Source) at java.sql.DriverManager.getConnection(DriverManager.java:322) at java.sql.DriverManager.getConnection(DriverManager.java:297) at org.apache.derbyTesting.junit.DriverManagerConnector.openConnection(DriverManagerConnector.java:81) at org.apache.derbyTesting.junit.DriverManagerConnector.openConnection(DriverManagerConnector.java:43) at org.apache.derbyTesting.junit.TestConfiguration.openDefaultConnection(TestConfiguration.java:1574) at org.apache.derbyTesting.junit.BaseJDBCTestSetup.getConnection(BaseJDBCTestSetup.java:72) at org.apache.derbyTesting.junit.DatabasePropertyTestSetup.tearDown(DatabasePropertyTestSetup.java:288) at junit.extensions.TestSetup$1.protect(TestSetup.java:22) at junit.extensions.TestSetup.run(TestSetup.java:18) at org.apache.derbyTesting.junit.BaseTestSetup.run(BaseTestSetup.java:57) at junit.extensions.TestDecorator.basicRun(TestDecorator.java:24) at junit.extensions.TestSetup$1.protect(TestSetup.java:21) at junit.extensions.TestSetup.run(TestSetup.java:18) at junit.extensions.TestDecorator.basicRun(TestDecorator.java:24) at junit.extensions.TestSetup$1.protect(TestSetup.java:21) at junit.extensions.TestSetup.run(TestSetup.java:18) at org.apache.derbyTesting.junit.BaseTestSetup.run(BaseTestSetup.java:57) at junit.extensions.TestDecorator.basicRun(TestDecorator.java:24) at junit.extensions.TestSetup$1.protect(TestSetup.java:21) at junit.extensions.TestSetup.run(TestSetup.java:18) at org.apache.derbyTesting.junit.BaseTestSetup.run(BaseTestSetup.java:57) at junit.extensions.TestDecorator.basicRun(TestDecorator.java:24) at junit.extensions.TestSetup$1.protect(TestSetup.java:21) at junit.extensions.TestSetup.run(TestSetup.java:18) at junit.extensions.TestDecorator.basicRun(TestDecorator.java:24) at junit.extensions.TestSetup$1.protect(TestSetup.java:21) at junit.extensions.TestSetup.run(TestSetup.java:18) at org.apache.derbyTesting.junit.BaseTestSetup.run(BaseTestSetup.java:57) at junit.extensions.TestDecorator.basicRun(TestDecorator.java:24) at junit.extensions.TestSetup$1.protect(TestSetup.java:21) at junit.extensions.TestSetup.run(TestSetup.java:18) Caused by: java.sql.SQLException: Database connection refused. at org.apache.derby.impl.jdbc.SQLExceptionFactory.getSQLException(Unknown Source) at org.apache.derby.impl.jdbc.SQLExceptionFactory40.wrapArgsForTransportAcrossDRDA(Unknown Source) ... 62 more Caused by: ERROR 08004: Database connection refused. at org.apache.derby.iapi.error.StandardException.newException(Unknown Source) at org.apache.derby.impl.sql.conn.GenericAuthorizer.refresh(Unknown Source) at org.apache.derby.impl.sql.conn.GenericAuthorizer.<init>(Unknown Source) at org.apache.derby.impl.sql.conn.GenericLanguageConnectionContext.initialize(Unknown Source) at org.apache.derby.impl.db.BasicDatabase.setupConnection(Unknown Source) at org.apache.derby.impl.jdbc.TransactionResourceImpl.startTransaction(Unknown Source) ... 57 more 3) testConnectShutdownAuthentication(org.apache.derbyTesting.functionTests.tests.jdbcapi.DriverMgrAuthenticationTest)java.sql.SQLNonTransientConnectionException: Database connection refused. at java.lang.Throwable.<init>(Throwable.java:80) at java.sql.SQLException.<init>(SQLException.java:153) at java.sql.SQLException.<init>(SQLException.java:176) at org.apache.derby.impl.jdbc.SQLExceptionFactory40.getSQLException(Unknown Source) at org.apache.derby.impl.jdbc.Util.generateCsSQLException(Unknown Source) at org.apache.derby.impl.jdbc.TransactionResourceImpl.wrapInSQLException(Unknown Source) at org.apache.derby.impl.jdbc.TransactionResourceImpl.handleException(Unknown Source) at org.apache.derby.impl.jdbc.EmbedConnection.handleException(Unknown Source) at org.apache.derby.impl.jdbc.EmbedConnection.checkUserIsNotARole(Unknown Source) at org.apache.derby.impl.jdbc.EmbedConnection.checkUserCredentials(Unknown Source) at org.apache.derby.impl.jdbc.EmbedConnection.<init>(Unknown Source) at org.apache.derby.jdbc.Driver40.getNewEmbedConnection(Unknown Source) at org.apache.derby.jdbc.InternalDriver.connect(Unknown Source) at org.apache.derby.jdbc.AutoloadedDriver.connect(Unknown Source) at java.sql.DriverManager.getConnection(DriverManager.java:322) at java.sql.DriverManager.getConnection(DriverManager.java:297) at org.apache.derbyTesting.junit.DriverManagerConnector.openConnection(DriverManagerConnector.java:81) at org.apache.derbyTesting.junit.DriverManagerConnector.openConnection(DriverManagerConnector.java:43) at org.apache.derbyTesting.junit.TestConfiguration.openDefaultConnection(TestConfiguration.java:1574) at org.apache.derbyTesting.junit.BaseJDBCTestSetup.getConnection(BaseJDBCTestSetup.java:72) at org.apache.derbyTesting.junit.DatabasePropertyTestSetup.tearDown(DatabasePropertyTestSetup.java:288) at junit.extensions.TestSetup$1.protect(TestSetup.java:22) at junit.extensions.TestSetup.run(TestSetup.java:18) at org.apache.derbyTesting.junit.BaseTestSetup.run(BaseTestSetup.java:57) at junit.extensions.TestDecorator.basicRun(TestDecorator.java:24) at junit.extensions.TestSetup$1.protect(TestSetup.java:21) at junit.extensions.TestSetup.run(TestSetup.java:18) at org.apache.derbyTesting.junit.BaseTestSetup.run(BaseTestSetup.java:57) at junit.extensions.TestDecorator.basicRun(TestDecorator.java:24) at junit.extensions.TestSetup$1.protect(TestSetup.java:21) at junit.extensions.TestSetup.run(TestSetup.java:18) at junit.extensions.TestDecorator.basicRun(TestDecorator.java:24) at junit.extensions.TestSetup$1.protect(TestSetup.java:21) at junit.extensions.TestSetup.run(TestSetup.java:18) at org.apache.derbyTesting.junit.BaseTestSetup.run(BaseTestSetup.java:57) at junit.extensions.TestDecorator.basicRun(TestDecorator.java:24) at junit.extensions.TestSetup$1.protect(TestSetup.java:21) at junit.extensions.TestSetup.run(TestSetup.java:18) Caused by: java.sql.SQLException: Database connection refused. at org.apache.derby.impl.jdbc.SQLExceptionFactory.getSQLException(Unknown Source) at org.apache.derby.impl.jdbc.SQLExceptionFactory40.wrapArgsForTransportAcrossDRDA(Unknown Source) ... 53 more Caused by: ERROR 08004: Database connection refused. at org.apache.derby.iapi.error.StandardException.newException(Unknown Source) at org.apache.derby.impl.sql.conn.GenericAuthorizer.refresh(Unknown Source) at org.apache.derby.impl.sql.conn.GenericAuthorizer.<init>(Unknown Source) at org.apache.derby.impl.sql.conn.GenericLanguageConnectionContext.initialize(Unknown Source) at org.apache.derby.impl.db.BasicDatabase.setupConnection(Unknown Source) at org.apache.derby.impl.jdbc.TransactionResourceImpl.startTransaction(Unknown Source) ... 48 more 4) testConnectShutdownAuthentication(org.apache.derbyTesting.functionTests.tests.jdbcapi.DriverMgrAuthenticationTest)java.sql.SQLNonTransientConnectionException: Database connection refused. at java.lang.Throwable.<init>(Throwable.java:80) at java.sql.SQLException.<init>(SQLException.java:153) at java.sql.SQLException.<init>(SQLException.java:176) at org.apache.derby.impl.jdbc.SQLExceptionFactory40.getSQLException(Unknown Source) at org.apache.derby.impl.jdbc.Util.generateCsSQLException(Unknown Source) at org.apache.derby.impl.jdbc.TransactionResourceImpl.wrapInSQLException(Unknown Source) at org.apache.derby.impl.jdbc.TransactionResourceImpl.handleException(Unknown Source) at org.apache.derby.impl.jdbc.EmbedConnection.handleException(Unknown Source) at org.apache.derby.impl.jdbc.EmbedConnection.checkUserIsNotARole(Unknown Source) at org.apache.derby.impl.jdbc.EmbedConnection.checkUserCredentials(Unknown Source) at org.apache.derby.impl.jdbc.EmbedConnection.<init>(Unknown Source) at org.apache.derby.jdbc.Driver40.getNewEmbedConnection(Unknown Source) at org.apache.derby.jdbc.InternalDriver.connect(Unknown Source) at org.apache.derby.jdbc.AutoloadedDriver.connect(Unknown Source) at java.sql.DriverManager.getConnection(DriverManager.java:322) at java.sql.DriverManager.getConnection(DriverManager.java:297) at org.apache.derbyTesting.junit.DriverManagerConnector.openConnection(DriverManagerConnector.java:81) at org.apache.derbyTesting.junit.DriverManagerConnector.openConnection(DriverManagerConnector.java:43) at org.apache.derbyTesting.junit.TestConfiguration.openDefaultConnection(TestConfiguration.java:1574) at org.apache.derbyTesting.junit.BaseJDBCTestSetup.getConnection(BaseJDBCTestSetup.java:72) at org.apache.derbyTesting.junit.DatabasePropertyTestSetup.tearDown(DatabasePropertyTestSetup.java:288) at junit.extensions.TestSetup$1.protect(TestSetup.java:22) at junit.extensions.TestSetup.run(TestSetup.java:18) at org.apache.derbyTesting.junit.BaseTestSetup.run(BaseTestSetup.java:57) at junit.extensions.TestDecorator.basicRun(TestDecorator.java:24) at junit.extensions.TestSetup$1.protect(TestSetup.java:21) at junit.extensions.TestSetup.run(TestSetup.java:18) at junit.extensions.TestDecorator.basicRun(TestDecorator.java:24) at junit.extensions.TestSetup$1.protect(TestSetup.java:21) at junit.extensions.TestSetup.run(TestSetup.java:18) at org.apache.derbyTesting.junit.BaseTestSetup.run(BaseTestSetup.java:57) at junit.extensions.TestDecorator.basicRun(TestDecorator.java:24) at junit.extensions.TestSetup$1.protect(TestSetup.java:21) at junit.extensions.TestSetup.run(TestSetup.java:18) Caused by: java.sql.SQLException: Database connection refused. at org.apache.derby.impl.jdbc.SQLExceptionFactory.getSQLException(Unknown Source) at org.apache.derby.impl.jdbc.SQLExceptionFactory40.wrapArgsForTransportAcrossDRDA(Unknown Source) ... 48 more Caused by: ERROR 08004: Database connection refused. at org.apache.derby.iapi.error.StandardException.newException(Unknown Source) at org.apache.derby.impl.sql.conn.GenericAuthorizer.refresh(Unknown Source) at org.apache.derby.impl.sql.conn.GenericAuthorizer.<init>(Unknown Source) at org.apache.derby.impl.sql.conn.GenericLanguageConnectionContext.initialize(Unknown Source) at org.apache.derby.impl.db.BasicDatabase.setupConnection(Unknown Source) at org.apache.derby.impl.jdbc.TransactionResourceImpl.startTransaction(Unknown Source) ... 43 more 5) testUserFunctions(org.apache.derbyTesting.functionTests.tests.jdbcapi.DriverMgrAuthenticationTest)java.sql.SQLNonTransientConnectionException: Database connection refused. at java.lang.Throwable.<init>(Throwable.java:80) at java.sql.SQLException.<init>(SQLException.java:153) at java.sql.SQLException.<init>(SQLException.java:176) at org.apache.derby.impl.jdbc.SQLExceptionFactory40.getSQLException(Unknown Source) at org.apache.derby.impl.jdbc.Util.generateCsSQLException(Unknown Source) at org.apache.derby.impl.jdbc.TransactionResourceImpl.wrapInSQLException(Unknown Source) at org.apache.derby.impl.jdbc.TransactionResourceImpl.handleException(Unknown Source) at org.apache.derby.impl.jdbc.EmbedConnection.handleException(Unknown Source) at org.apache.derby.impl.jdbc.EmbedConnection.checkUserIsNotARole(Unknown Source) at org.apache.derby.impl.jdbc.EmbedConnection.checkUserCredentials(Unknown Source) at org.apache.derby.impl.jdbc.EmbedConnection.<init>(Unknown Source) at org.apache.derby.jdbc.Driver40.getNewEmbedConnection(Unknown Source) at org.apache.derby.jdbc.InternalDriver.connect(Unknown Source) at org.apache.derby.jdbc.AutoloadedDriver.connect(Unknown Source) at java.sql.DriverManager.getConnection(DriverManager.java:322) at java.sql.DriverManager.getConnection(DriverManager.java:297) at org.apache.derbyTesting.junit.DriverManagerConnector.openConnection(DriverManagerConnector.java:81) at org.apache.derbyTesting.junit.DriverManagerConnector.openConnection(DriverManagerConnector.java:43) at org.apache.derbyTesting.junit.TestConfiguration.openDefaultConnection(TestConfiguration.java:1574) at org.apache.derbyTesting.junit.BaseJDBCTestSetup.getConnection(BaseJDBCTestSetup.java:72) at org.apache.derbyTesting.junit.DatabasePropertyTestSetup.setProperties(DatabasePropertyTestSetup.java:322) at org.apache.derbyTesting.junit.DatabasePropertyTestSetup.setUp(DatabasePropertyTestSetup.java:268) at junit.extensions.TestSetup$1.protect(TestSetup.java:20) at junit.extensions.TestSetup.run(TestSetup.java:18) at org.apache.derbyTesting.junit.BaseTestSetup.run(BaseTestSetup.java:57) at junit.extensions.TestDecorator.basicRun(TestDecorator.java:24) at junit.extensions.TestSetup$1.protect(TestSetup.java:21) at junit.extensions.TestSetup.run(TestSetup.java:18) at junit.extensions.TestDecorator.basicRun(TestDecorator.java:24) at junit.extensions.TestSetup$1.protect(TestSetup.java:21) at junit.extensions.TestSetup.run(TestSetup.java:18) at org.apache.derbyTesting.junit.BaseTestSetup.run(BaseTestSetup.java:57) at junit.extensions.TestDecorator.basicRun(TestDecorator.java:24) at junit.extensions.TestSetup$1.protect(TestSetup.java:21) at junit.extensions.TestSetup.run(TestSetup.java:18) Caused by: java.sql.SQLException: Database connection refused. at org.apache.derby.impl.jdbc.SQLExceptionFactory.getSQLException(Unknown Source) at org.apache.derby.impl.jdbc.SQLExceptionFactory40.wrapArgsForTransportAcrossDRDA(Unknown Source) ... 49 more Caused by: ERROR 08004: Database connection refused. at org.apache.derby.iapi.error.StandardException.newException(Unknown Source) at org.apache.derby.impl.sql.conn.GenericAuthorizer.refresh(Unknown Source) at org.apache.derby.impl.sql.conn.GenericAuthorizer.<init>(Unknown Source) at org.apache.derby.impl.sql.conn.GenericLanguageConnectionContext.initialize(Unknown Source) at org.apache.derby.impl.db.BasicDatabase.setupConnection(Unknown Source) at org.apache.derby.impl.jdbc.TransactionResourceImpl.startTransaction(Unknown Source) ... 44 more 6) testNotFullAccessUsers(org.apache.derbyTesting.functionTests.tests.jdbcapi.DriverMgrAuthenticationTest)java.sql.SQLNonTransientConnectionException: Database connection refused. at java.lang.Throwable.<init>(Throwable.java:80) at java.sql.SQLException.<init>(SQLException.java:153) at java.sql.SQLException.<init>(SQLException.java:176) at org.apache.derby.impl.jdbc.SQLExceptionFactory40.getSQLException(Unknown Source) at org.apache.derby.impl.jdbc.Util.generateCsSQLException(Unknown Source) at org.apache.derby.impl.jdbc.TransactionResourceImpl.wrapInSQLException(Unknown Source) at org.apache.derby.impl.jdbc.TransactionResourceImpl.handleException(Unknown Source) at org.apache.derby.impl.jdbc.EmbedConnection.handleException(Unknown Source) at org.apache.derby.impl.jdbc.EmbedConnection.checkUserIsNotARole(Unknown Source) at org.apache.derby.impl.jdbc.EmbedConnection.checkUserCredentials(Unknown Source) at org.apache.derby.impl.jdbc.EmbedConnection.<init>(Unknown Source) at org.apache.derby.jdbc.Driver40.getNewEmbedConnection(Unknown Source) at org.apache.derby.jdbc.InternalDriver.connect(Unknown Source) at org.apache.derby.jdbc.AutoloadedDriver.connect(Unknown Source) at java.sql.DriverManager.getConnection(DriverManager.java:322) at java.sql.DriverManager.getConnection(DriverManager.java:297) at org.apache.derbyTesting.junit.DriverManagerConnector.openConnection(DriverManagerConnector.java:81) at org.apache.derbyTesting.junit.DriverManagerConnector.openConnection(DriverManagerConnector.java:43) at org.apache.derbyTesting.junit.TestConfiguration.openDefaultConnection(TestConfiguration.java:1574) at org.apache.derbyTesting.junit.BaseJDBCTestSetup.getConnection(BaseJDBCTestSetup.java:72) at org.apache.derbyTesting.junit.DatabasePropertyTestSetup.setProperties(DatabasePropertyTestSetup.java:322) at org.apache.derbyTesting.junit.DatabasePropertyTestSetup.setUp(DatabasePropertyTestSetup.java:268) at junit.extensions.TestSetup$1.protect(TestSetup.java:20) at junit.extensions.TestSetup.run(TestSetup.java:18) at org.apache.derbyTesting.junit.BaseTestSetup.run(BaseTestSetup.java:57) at junit.extensions.TestDecorator.basicRun(TestDecorator.java:24) at junit.extensions.TestSetup$1.protect(TestSetup.java:21) at junit.extensions.TestSetup.run(TestSetup.java:18) at junit.extensions.TestDecorator.basicRun(TestDecorator.java:24) at junit.extensions.TestSetup$1.protect(TestSetup.java:21) at junit.extensions.TestSetup.run(TestSetup.java:18) at org.apache.derbyTesting.junit.BaseTestSetup.run(BaseTestSetup.java:57) at junit.extensions.TestDecorator.basicRun(TestDecorator.java:24) at junit.extensions.TestSetup$1.protect(TestSetup.java:21) at junit.extensions.TestSetup.run(TestSetup.java:18) Caused by: java.sql.SQLException: Database connection refused. at org.apache.derby.impl.jdbc.SQLExceptionFactory.getSQLException(Unknown Source) at org.apache.derby.impl.jdbc.SQLExceptionFactory40.wrapArgsForTransportAcrossDRDA(Unknown Source) ... 49 more Caused by: ERROR 08004: Database connection refused. at org.apache.derby.iapi.error.StandardException.newException(Unknown Source) at org.apache.derby.impl.sql.conn.GenericAuthorizer.refresh(Unknown Source) at org.apache.derby.impl.sql.conn.GenericAuthorizer.<init>(Unknown Source) at org.apache.derby.impl.sql.conn.GenericLanguageConnectionContext.initialize(Unknown Source) at org.apache.derby.impl.db.BasicDatabase.setupConnection(Unknown Source) at org.apache.derby.impl.jdbc.TransactionResourceImpl.startTransaction(Unknown Source) ... 44 more 7) testChangePasswordAndDatabasePropertiesOnly(org.apache.derbyTesting.functionTests.tests.jdbcapi.DriverMgrAuthenticationTest)java.sql.SQLNonTransientConnectionException: Database connection refused. at java.lang.Throwable.<init>(Throwable.java:80) at java.sql.SQLException.<init>(SQLException.java:153) at java.sql.SQLException.<init>(SQLException.java:176) at org.apache.derby.impl.jdbc.SQLExceptionFactory40.getSQLException(Unknown Source) at org.apache.derby.impl.jdbc.Util.generateCsSQLException(Unknown Source) at org.apache.derby.impl.jdbc.TransactionResourceImpl.wrapInSQLException(Unknown Source) at org.apache.derby.impl.jdbc.TransactionResourceImpl.handleException(Unknown Source) at org.apache.derby.impl.jdbc.EmbedConnection.handleException(Unknown Source) at org.apache.derby.impl.jdbc.EmbedConnection.checkUserIsNotARole(Unknown Source) at org.apache.derby.impl.jdbc.EmbedConnection.checkUserCredentials(Unknown Source) at org.apache.derby.impl.jdbc.EmbedConnection.<init>(Unknown Source) at org.apache.derby.jdbc.Driver40.getNewEmbedConnection(Unknown Source) at org.apache.derby.jdbc.InternalDriver.connect(Unknown Source) at org.apache.derby.jdbc.AutoloadedDriver.connect(Unknown Source) at java.sql.DriverManager.getConnection(DriverManager.java:322) at java.sql.DriverManager.getConnection(DriverManager.java:297) at org.apache.derbyTesting.junit.DriverManagerConnector.openConnection(DriverManagerConnector.java:81) at org.apache.derbyTesting.junit.DriverManagerConnector.openConnection(DriverManagerConnector.java:43) at org.apache.derbyTesting.junit.TestConfiguration.openDefaultConnection(TestConfiguration.java:1574) at org.apache.derbyTesting.junit.BaseJDBCTestSetup.getConnection(BaseJDBCTestSetup.java:72) at org.apache.derbyTesting.junit.DatabasePropertyTestSetup.setProperties(DatabasePropertyTestSetup.java:322) at org.apache.derbyTesting.junit.DatabasePropertyTestSetup.setUp(DatabasePropertyTestSetup.java:268) at junit.extensions.TestSetup$1.protect(TestSetup.java:20) at junit.extensions.TestSetup.run(TestSetup.java:18) at org.apache.derbyTesting.junit.BaseTestSetup.run(BaseTestSetup.java:57) at junit.extensions.TestDecorator.basicRun(TestDecorator.java:24) at junit.extensions.TestSetup$1.protect(TestSetup.java:21) at junit.extensions.TestSetup.run(TestSetup.java:18) at junit.extensions.TestDecorator.basicRun(TestDecorator.java:24) at junit.extensions.TestSetup$1.protect(TestSetup.java:21) at junit.extensions.TestSetup.run(TestSetup.java:18) at org.apache.derbyTesting.junit.BaseTestSetup.run(BaseTestSetup.java:57) at junit.extensions.TestDecorator.basicRun(TestDecorator.java:24) at junit.extensions.TestSetup$1.protect(TestSetup.java:21) at junit.extensions.TestSetup.run(TestSetup.java:18) Caused by: java.sql.SQLException: Database connection refused. at org.apache.derby.impl.jdbc.SQLExceptionFactory.getSQLException(Unknown Source) at org.apache.derby.impl.jdbc.SQLExceptionFactory40.wrapArgsForTransportAcrossDRDA(Unknown Source) ... 49 more Caused by: ERROR 08004: Database connection refused. at org.apache.derby.iapi.error.StandardException.newException(Unknown Source) at org.apache.derby.impl.sql.conn.GenericAuthorizer.refresh(Unknown Source) at org.apache.derby.impl.sql.conn.GenericAuthorizer.<init>(Unknown Source) at org.apache.derby.impl.sql.conn.GenericLanguageConnectionContext.initialize(Unknown Source) at org.apache.derby.impl.db.BasicDatabase.setupConnection(Unknown Source) at org.apache.derby.impl.jdbc.TransactionResourceImpl.startTransaction(Unknown Source) ... 44 more 8) testGreekCharacters(org.apache.derbyTesting.functionTests.tests.jdbcapi.DriverMgrAuthenticationTest)java.sql.SQLNonTransientConnectionException: Database connection refused. at java.lang.Throwable.<init>(Throwable.java:80) at java.sql.SQLException.<init>(SQLException.java:153) at java.sql.SQLException.<init>(SQLException.java:176) at org.apache.derby.impl.jdbc.SQLExceptionFactory40.getSQLException(Unknown Source) at org.apache.derby.impl.jdbc.Util.generateCsSQLException(Unknown Source) at org.apache.derby.impl.jdbc.TransactionResourceImpl.wrapInSQLException(Unknown Source) at org.apache.derby.impl.jdbc.TransactionResourceImpl.handleException(Unknown Source) at org.apache.derby.impl.jdbc.EmbedConnection.handleException(Unknown Source) at org.apache.derby.impl.jdbc.EmbedConnection.checkUserIsNotARole(Unknown Source) at org.apache.derby.impl.jdbc.EmbedConnection.checkUserCredentials(Unknown Source) at org.apache.derby.impl.jdbc.EmbedConnection.<init>(Unknown Source) at org.apache.derby.jdbc.Driver40.getNewEmbedConnection(Unknown Source) at org.apache.derby.jdbc.InternalDriver.connect(Unknown Source) at org.apache.derby.jdbc.AutoloadedDriver.connect(Unknown Source) at java.sql.DriverManager.getConnection(DriverManager.java:322) at java.sql.DriverManager.getConnection(DriverManager.java:297) at org.apache.derbyTesting.junit.DriverManagerConnector.openConnection(DriverManagerConnector.java:81) at org.apache.derbyTesting.junit.DriverManagerConnector.openConnection(DriverManagerConnector.java:43) at org.apache.derbyTesting.junit.TestConfiguration.openDefaultConnection(TestConfiguration.java:1574) at org.apache.derbyTesting.junit.BaseJDBCTestSetup.getConnection(BaseJDBCTestSetup.java:72) at org.apache.derbyTesting.junit.DatabasePropertyTestSetup.setProperties(DatabasePropertyTestSetup.java:322) at org.apache.derbyTesting.junit.DatabasePropertyTestSetup.setUp(DatabasePropertyTestSetup.java:268) at junit.extensions.TestSetup$1.protect(TestSetup.java:20) at junit.extensions.TestSetup.run(TestSetup.java:18) at org.apache.derbyTesting.junit.BaseTestSetup.run(BaseTestSetup.java:57) at junit.extensions.TestDecorator.basicRun(TestDecorator.java:24) at junit.extensions.TestSetup$1.protect(TestSetup.java:21) at junit.extensions.TestSetup.run(TestSetup.java:18) at junit.extensions.TestDecorator.basicRun(TestDecorator.java:24) at junit.extensions.TestSetup$1.protect(TestSetup.java:21) at junit.extensions.TestSetup.run(TestSetup.java:18) at org.apache.derbyTesting.junit.BaseTestSetup.run(BaseTestSetup.java:57) at junit.extensions.TestDecorator.basicRun(TestDecorator.java:24) at junit.extensions.TestSetup$1.protect(TestSetup.java:21) at junit.extensions.TestSetup.run(TestSetup.java:18) Caused by: java.sql.SQLException: Database connection refused. at org.apache.derby.impl.jdbc.SQLExceptionFactory.getSQLException(Unknown Source) at org.apache.derby.impl.jdbc.SQLExceptionFactory40.wrapArgsForTransportAcrossDRDA(Unknown Source) ... 49 more Caused by: ERROR 08004: Database connection refused. at org.apache.derby.iapi.error.StandardException.newException(Unknown Source) at org.apache.derby.impl.sql.conn.GenericAuthorizer.refresh(Unknown Source) at org.apache.derby.impl.sql.conn.GenericAuthorizer.<init>(Unknown Source) at org.apache.derby.impl.sql.conn.GenericLanguageConnectionContext.initialize(Unknown Source) at org.apache.derby.impl.db.BasicDatabase.setupConnection(Unknown Source) at org.apache.derby.impl.jdbc.TransactionResourceImpl.startTransaction(Unknown Source) ... 44 more 9) testSystemShutdown(org.apache.derbyTesting.functionTests.tests.jdbcapi.DriverMgrAuthenticationTest)java.sql.SQLNonTransientConnectionException: Database connection refused. at java.lang.Throwable.<init>(Throwable.java:80) at java.sql.SQLException.<init>(SQLException.java:153) at java.sql.SQLException.<init>(SQLException.java:176) at org.apache.derby.impl.jdbc.SQLExceptionFactory40.getSQLException(Unknown Source) at org.apache.derby.impl.jdbc.Util.generateCsSQLException(Unknown Source) at org.apache.derby.impl.jdbc.TransactionResourceImpl.wrapInSQLException(Unknown Source) at org.apache.derby.impl.jdbc.TransactionResourceImpl.handleException(Unknown Source) at org.apache.derby.impl.jdbc.EmbedConnection.handleException(Unknown Source) at org.apache.derby.impl.jdbc.EmbedConnection.checkUserIsNotARole(Unknown Source) at org.apache.derby.impl.jdbc.EmbedConnection.checkUserCredentials(Unknown Source) at org.apache.derby.impl.jdbc.EmbedConnection.<init>(Unknown Source) at org.apache.derby.jdbc.Driver40.getNewEmbedConnection(Unknown Source) at org.apache.derby.jdbc.InternalDriver.connect(Unknown Source) at org.apache.derby.jdbc.AutoloadedDriver.connect(Unknown Source) at java.sql.DriverManager.getConnection(DriverManager.java:322) at java.sql.DriverManager.getConnection(DriverManager.java:297) at org.apache.derbyTesting.junit.DriverManagerConnector.openConnection(DriverManagerConnector.java:81) at org.apache.derbyTesting.junit.DriverManagerConnector.openConnection(DriverManagerConnector.java:43) at org.apache.derbyTesting.junit.TestConfiguration.openDefaultConnection(TestConfiguration.java:1574) at org.apache.derbyTesting.junit.BaseJDBCTestSetup.getConnection(BaseJDBCTestSetup.java:72) at org.apache.derbyTesting.junit.DatabasePropertyTestSetup.setProperties(DatabasePropertyTestSetup.java:322) at org.apache.derbyTesting.junit.DatabasePropertyTestSetup.setUp(DatabasePropertyTestSetup.java:268) at junit.extensions.TestSetup$1.protect(TestSetup.java:20) at junit.extensions.TestSetup.run(TestSetup.java:18) at org.apache.derbyTesting.junit.BaseTestSetup.run(BaseTestSetup.java:57) at junit.extensions.TestDecorator.basicRun(TestDecorator.java:24) at junit.extensions.TestSetup$1.protect(TestSetup.java:21) at junit.extensions.TestSetup.run(TestSetup.java:18) at junit.extensions.TestDecorator.basicRun(TestDecorator.java:24) at junit.extensions.TestSetup$1.protect(TestSetup.java:21) at junit.extensions.TestSetup.run(TestSetup.java:18) at org.apache.derbyTesting.junit.BaseTestSetup.run(BaseTestSetup.java:57) at junit.extensions.TestDecorator.basicRun(TestDecorator.java:24) at junit.extensions.TestSetup$1.protect(TestSetup.java:21) at junit.extensions.TestSetup.run(TestSetup.java:18) Caused by: java.sql.SQLException: Database connection refused. at org.apache.derby.impl.jdbc.SQLExceptionFactory.getSQLException(Unknown Source) at org.apache.derby.impl.jdbc.SQLExceptionFactory40.wrapArgsForTransportAcrossDRDA(Unknown Source) ... 49 more Caused by: ERROR 08004: Database connection refused. at org.apache.derby.iapi.error.StandardException.newException(Unknown Source) at org.apache.derby.impl.sql.conn.GenericAuthorizer.refresh(Unknown Source) at org.apache.derby.impl.sql.conn.GenericAuthorizer.<init>(Unknown Source) at org.apache.derby.impl.sql.conn.GenericLanguageConnectionContext.initialize(Unknown Source) at org.apache.derby.impl.db.BasicDatabase.setupConnection(Unknown Source) at org.apache.derby.impl.jdbc.TransactionResourceImpl.startTransaction(Unknown Source) ... 44 more 10) DriverMgrAuthenticationTestjava.sql.SQLNonTransientConnectionException: Database connection refused. at java.lang.Throwable.<init>(Throwable.java:80) at java.sql.SQLException.<init>(SQLException.java:153) at java.sql.SQLException.<init>(SQLException.java:176) at org.apache.derby.impl.jdbc.SQLExceptionFactory40.getSQLException(Unknown Source) at org.apache.derby.impl.jdbc.Util.generateCsSQLException(Unknown Source) at org.apache.derby.impl.jdbc.TransactionResourceImpl.wrapInSQLException(Unknown Source) at org.apache.derby.impl.jdbc.TransactionResourceImpl.handleException(Unknown Source) at org.apache.derby.impl.jdbc.EmbedConnection.handleException(Unknown Source) at org.apache.derby.impl.jdbc.EmbedConnection.checkUserIsNotARole(Unknown Source) at org.apache.derby.impl.jdbc.EmbedConnection.checkUserCredentials(Unknown Source) at org.apache.derby.impl.jdbc.EmbedConnection.<init>(Unknown Source) at org.apache.derby.jdbc.Driver40.getNewEmbedConnection(Unknown Source) at org.apache.derby.jdbc.InternalDriver.connect(Unknown Source) at org.apache.derby.jdbc.AutoloadedDriver.connect(Unknown Source) at java.sql.DriverManager.getConnection(DriverManager.java:322) at java.sql.DriverManager.getConnection(DriverManager.java:297) at org.apache.derbyTesting.junit.DriverManagerConnector.openConnection(DriverManagerConnector.java:81) at org.apache.derbyTesting.junit.DriverManagerConnector.openConnection(DriverManagerConnector.java:47) at org.apache.derbyTesting.junit.TestConfiguration.openConnection(TestConfiguration.java:1603) at org.apache.derbyTesting.junit.DropDatabaseSetup.tearDown(DropDatabaseSetup.java:54) at junit.extensions.TestSetup$1.protect(TestSetup.java:22) at junit.extensions.TestSetup.run(TestSetup.java:18) at org.apache.derbyTesting.junit.BaseTestSetup.run(BaseTestSetup.java:57) at junit.extensions.TestDecorator.basicRun(TestDecorator.java:24) at junit.extensions.TestSetup$1.protect(TestSetup.java:21) at junit.extensions.TestSetup.run(TestSetup.java:18) Caused by: java.sql.SQLException: Database connection refused. at org.apache.derby.impl.jdbc.SQLExceptionFactory.getSQLException(Unknown Source) at org.apache.derby.impl.jdbc.SQLExceptionFactory40.wrapArgsForTransportAcrossDRDA(Unknown Source) ... 36 more Caused by: ERROR 08004: Database connection refused. at org.apache.derby.iapi.error.StandardException.newException(Unknown Source) at org.apache.derby.impl.sql.conn.GenericAuthorizer.refresh(Unknown Source) at org.apache.derby.impl.sql.conn.GenericAuthorizer.<init>(Unknown Source) at org.apache.derby.impl.sql.conn.GenericLanguageConnectionContext.initialize(Unknown Source) at org.apache.derby.impl.db.BasicDatabase.setupConnection(Unknown Source) at org.apache.derby.impl.jdbc.TransactionResourceImpl.startTransaction(Unknown Source) ... 31 more

            People

            • Assignee:
              Unassigned
              Reporter:
              Mike Matrigali
            • Votes:
              0 Vote for this issue
              Watchers:
              0 Start watching this issue

              Dates

              • Created:
                Updated:
                Resolved:

                Development