Derby
  1. Derby
  2. DERBY-1750

encryption/stress.multi fails with FatalException: XJ001: Java exception: ': java.lang.AbstractMethodError'. on Linux and Windows XP

    Details

    • Type: Bug Bug
    • Status: Closed
    • Priority: Major Major
    • Resolution: Cannot Reproduce
    • Affects Version/s: 10.2.1.6
    • Fix Version/s: None
    • Component/s: Test
    • Labels:
      None
    • Environment:
    • Urgency:
      Normal
    • Bug behavior facts:
      Regression Test Failure

      Description

      encryption/encryption.fail:stress/stress.multi

                      • Diff file encryption/multi/stress.diff
          • Start: stress jdk1.6.0-rc encryption:multi 2006-08-14 13:33:14 ***
            6 del
            < TEST CASE SUMMARY: normal termination
            7 del
            < ...running last checks via final.sql
            7 add
            > TEST CASE SUMMARY: abnormal termination due to error(s) – see test log (./stress/stress.log) for details
            Test Failed.
          • End: stress jdk1.6.0-rc encryption:multi 2006-08-14 13:39:02 ***
            ------------------------------------------------------

      From stress.log:
      .....
      Tester6: SELECT1 Mon Aug 14 13:38:25 CEST 2006
      Tester4: insert Mon Aug 14 13:38:25 CEST 2006
      Tester10: TERMINATING due to unexpected error:
      FatalException: XJ001: Java exception: ': java.lang.AbstractMethodError'.
      Tester1: update Mon Aug 14 13:38:25 CEST 2006
      Tester1: roll Mon Aug 14 13:38:25 CEST 2006
      .....
      Deleting Tester9.out(/export/home/tmp/jagtmp/autoderbyN_regression/encryption_6/log/encryption/multi)
      Tester10 failed.

        Activity

        Henri van de Scheur created issue -
        Mike Matrigali made changes -
        Field Original Value New Value
        Component/s Regression Test Failure [ 12310664 ]
        Description

        encryption/encryption.fail:stress/stress.multi

        ********* Diff file encryption/multi/stress.diff
        *** Start: stress jdk1.6.0-rc encryption:multi 2006-08-14 13:33:14 ***
        6 del
        < TEST CASE SUMMARY: normal termination
        7 del
        < ...running last checks via final.sql
        7 add
        > TEST CASE SUMMARY: abnormal termination due to error(s) -- see test log (./stress/stress.log) for details
        Test Failed.
        *** End: stress jdk1.6.0-rc encryption:multi 2006-08-14 13:39:02 ***
        ------------------------------------------------------

        From stress.log:
        .....
        Tester6: SELECT1 Mon Aug 14 13:38:25 CEST 2006
        Tester4: insert Mon Aug 14 13:38:25 CEST 2006
        Tester10: TERMINATING due to unexpected error:
        FatalException: XJ001: Java exception: ': java.lang.AbstractMethodError'.
        Tester1: update Mon Aug 14 13:38:25 CEST 2006
        Tester1: roll Mon Aug 14 13:38:25 CEST 2006
        .....
        Deleting Tester9.out(/export/home/tmp/jagtmp/autoderbyN_regression/encryption_6/log/encryption/multi)
        Tester10 failed.


        encryption/encryption.fail:stress/stress.multi

        ********* Diff file encryption/multi/stress.diff
        *** Start: stress jdk1.6.0-rc encryption:multi 2006-08-14 13:33:14 ***
        6 del
        < TEST CASE SUMMARY: normal termination
        7 del
        < ...running last checks via final.sql
        7 add
        > TEST CASE SUMMARY: abnormal termination due to error(s) -- see test log (./stress/stress.log) for details
        Test Failed.
        *** End: stress jdk1.6.0-rc encryption:multi 2006-08-14 13:39:02 ***
        ------------------------------------------------------

        From stress.log:
        .....
        Tester6: SELECT1 Mon Aug 14 13:38:25 CEST 2006
        Tester4: insert Mon Aug 14 13:38:25 CEST 2006
        Tester10: TERMINATING due to unexpected error:
        FatalException: XJ001: Java exception: ': java.lang.AbstractMethodError'.
        Tester1: update Mon Aug 14 13:38:25 CEST 2006
        Tester1: roll Mon Aug 14 13:38:25 CEST 2006
        .....
        Deleting Tester9.out(/export/home/tmp/jagtmp/autoderbyN_regression/encryption_6/log/encryption/multi)
        Tester10 failed.

        Knut Anders Hatlen made changes -
        Status Open [ 1 ] Resolved [ 5 ]
        Resolution Cannot Reproduce [ 5 ]
        Henri van de Scheur made changes -
        Status Resolved [ 5 ] Closed [ 6 ]
        Dag H. Wanvik made changes -
        Derby Categories [Regression Test Failure]
        Dag H. Wanvik made changes -
        Component/s Regression Test Failure [ 12310664 ]
        Dag H. Wanvik made changes -
        Component/s Test [ 11413 ]
        Gavin made changes -
        Workflow jira [ 12382251 ] Default workflow, editable Closed status [ 12801452 ]

          People

          • Assignee:
            Unassigned
            Reporter:
            Henri van de Scheur
          • Votes:
            0 Vote for this issue
            Watchers:
            1 Start watching this issue

            Dates

            • Created:
              Updated:
              Resolved:

              Development