Uploaded image for project: 'CXF'
  1. CXF
  2. CXF-7270

CXF on java 9 build 159 fails

    XMLWordPrintableJSON

    Details

    • Type: Bug
    • Status: Closed
    • Priority: Major
    • Resolution: Fixed
    • Affects Version/s: None
    • Fix Version/s: 3.2.0
    • Component/s: JAX-WS Runtime
    • Labels:
      None
    • Estimated Complexity:
      Unknown

      Description

      Tested with latest Java 9 build 159. To reproduce run in systests/jaxws

      mvn clean install -Dtest=org.apache.cxf.systest.provider.ProviderClientServerTest#testSOAPMessageModeDocLit
      
      Tests run: 1, Failures: 1, Errors: 0, Skipped: 0, Time elapsed: 1.899 sec <<< FAILURE! - in org.apache.cxf.systest.provider.ProviderClientServerTest
      testSOAPMessageModeDocLit(org.apache.cxf.systest.provider.ProviderClientServerTest)  Time elapsed: 0.633 sec  <<< FAILURE!
      java.lang.AssertionError
              at org.apache.cxf.systest.provider.ProviderClientServerTest.testSOAPMessageModeDocLit(ProviderClientServerTest.java:104)
      

      Do we have a CI build for java 9 that runs all the tests? Thanks!

        Attachments

        1. CXF-7270.patch
          95 kB
          Freeman Yue Fang

          Issue Links

            Activity

              People

              • Assignee:
                ffang Freeman Yue Fang
                Reporter:
                jpoth John Poth
              • Votes:
                0 Vote for this issue
                Watchers:
                3 Start watching this issue

                Dates

                • Created:
                  Updated:
                  Resolved: