Uploaded image for project: 'Chemistry'
  1. Chemistry
  2. CMIS-426

Problem uploading file > 3Mb with OpenCmis and Alfresco

    XMLWordPrintableJSON

    Details

    • Type: Bug
    • Status: Resolved
    • Priority: Major
    • Resolution: Not A Problem
    • Affects Version/s: 0.2.0-incubating, OpenCMIS 0.3.0, OpenCMIS 0.4.0
    • Fix Version/s: OpenCMIS 0.4.0
    • Component/s: opencmis-client
    • Labels:
    • Environment:

      Ubuntu 10.04 and Alfresco 3.4 Community

      Description

      Developing with opencmis-0.4.0 I found that when I try to upload a file with 3mb (at least) the component throws the following exception:

      {{org.apache.chemistry.opencmis.commons.exceptions.CmisConnectionException: Cannot access http://localhost:7080/alfresco/service/cmis/s/workspace:SpacesStore/i/6ce55f14-3028-4fd9-b525-7855257d4803/children: null
      at org.apache.chemistry.opencmis.client.bindings.spi.atompub.HttpUtils.invoke(HttpUtils.java:149)
      at org.apache.chemistry.opencmis.client.bindings.spi.atompub.HttpUtils.invokePOST(HttpUtils.java:64)
      at org.apache.chemistry.opencmis.client.bindings.spi.atompub.AbstractAtomPubService.post(AbstractAtomPubService.java:493)
      at org.apache.chemistry.opencmis.client.bindings.spi.atompub.ObjectServiceImpl.createDocument(ObjectServiceImpl.java:109)
      at org.apache.chemistry.opencmis.client.runtime.SessionImpl.createDocument(SessionImpl.java:612)
      at org.apache.chemistry.opencmis.client.runtime.FolderImpl.createDocument(FolderImpl.java:96)
      at com.viavansi.pruebacmis.Prueba.main(Prueba.java:39)
      Caused by: java.lang.ArrayIndexOutOfBoundsException
      at java.lang.System.arraycopy(Native Method)
      at sun.net.www.http.ChunkedOutputStream.write(ChunkedOutputStream.java:184)
      at sun.net.www.protocol.http.HttpURLConnection$StreamingOutputStream.write(HttpURLConnection.java:2705)
      at java.io.BufferedOutputStream.flushBuffer(BufferedOutputStream.java:82)
      at java.io.BufferedOutputStream.write(BufferedOutputStream.java:126)
      at com.ctc.wstx.io.UTF8Writer.write(UTF8Writer.java:139)
      at com.ctc.wstx.sw.BufferingXmlWriter.writeRaw(BufferingXmlWriter.java:259)
      at com.ctc.wstx.sw.BufferingXmlWriter.writeCharacters(BufferingXmlWriter.java:543)
      at com.ctc.wstx.sw.BaseStreamWriter.writeCharacters(BaseStreamWriter.java:509)
      at org.apache.chemistry.opencmis.client.bindings.spi.atompub.AtomEntryWriter.writeContent(AtomEntryWriter.java:172)
      at org.apache.chemistry.opencmis.client.bindings.spi.atompub.AtomEntryWriter.write(AtomEntryWriter.java:123)
      at org.apache.chemistry.opencmis.client.bindings.spi.atompub.ObjectServiceImpl$1.write(ObjectServiceImpl.java:111)
      at org.apache.chemistry.opencmis.client.bindings.spi.atompub.HttpUtils.invoke(HttpUtils.java:131)
      ... 6 more}}

      And the log of Alfresco says:

      {{12:01:22,627 ERROR [org.springframework.extensions.webscripts.AbstractRuntime] Exception from executeScript - redirecting to status template error: 08010002 Wrapped Exception (with status template): 08010003 Failed to execute script 'classpath*:alfresco/templates/webscripts/org/alfresco/cmis/children.post.atom.js': com.ctc.wstx.exc.WstxUnexpectedCharException: Illegal character (NULL, unicode 0) encountered: not valid in any content
      at [row,col

      {unknown-source}]: [1,2093905]
      org.springframework.extensions.webscripts.WebScriptException: 08010002 Wrapped Exception (with status template): 08010003 Failed to execute script 'classpath*:alfresco/templates/webscripts/org/alfresco/cmis/children.post.atom.js': com.ctc.wstx.exc.WstxUnexpectedCharException: Illegal character (NULL, unicode 0) encountered: not valid in any content
      at [row,col {unknown-source}

      ]: [1,2093905]
      at org.springframework.extensions.webscripts.AbstractWebScript.createStatusException(AbstractWebScript.java:758)
      at org.springframework.extensions.webscripts.DeclarativeWebScript.execute(DeclarativeWebScript.java:171)
      at org.alfresco.repo.web.scripts.RepositoryContainer$2.execute(RepositoryContainer.java:383)
      at org.alfresco.repo.transaction.RetryingTransactionHelper.doInTransaction(RetryingTransactionHelper.java:381)
      at org.alfresco.repo.web.scripts.RepositoryContainer.transactionedExecute(RepositoryContainer.java:436)
      at org.alfresco.repo.web.scripts.RepositoryContainer.transactionedExecuteAs(RepositoryContainer.java:466)
      at org.alfresco.repo.web.scripts.RepositoryContainer.executeScript(RepositoryContainer.java:304)
      at org.springframework.extensions.webscripts.AbstractRuntime.executeScript(AbstractRuntime.java:333)
      at org.springframework.extensions.webscripts.AbstractRuntime.executeScript(AbstractRuntime.java:189)
      at org.springframework.extensions.webscripts.servlet.WebScriptServlet.service(WebScriptServlet.java:118)
      at javax.servlet.http.HttpServlet.service(HttpServlet.java:717)
      at org.apache.catalina.core.ApplicationFilterChain.internalDoFilter(ApplicationFilterChain.java:290)
      at org.apache.catalina.core.ApplicationFilterChain.doFilter(ApplicationFilterChain.java:206)
      at org.alfresco.web.app.servlet.GlobalLocalizationFilter.doFilter(GlobalLocalizationFilter.java:58)
      at org.apache.catalina.core.ApplicationFilterChain.internalDoFilter(ApplicationFilterChain.java:235)
      at org.apache.catalina.core.ApplicationFilterChain.doFilter(ApplicationFilterChain.java:206)
      at org.apache.catalina.core.StandardWrapperValve.invoke(StandardWrapperValve.java:233)
      at org.apache.catalina.core.StandardContextValve.invoke(StandardContextValve.java:191)
      at org.apache.catalina.core.StandardHostValve.invoke(StandardHostValve.java:127)
      at org.apache.catalina.valves.ErrorReportValve.invoke(ErrorReportValve.java:102)
      at org.apache.catalina.core.StandardEngineValve.invoke(StandardEngineValve.java:109)
      at org.apache.catalina.connector.CoyoteAdapter.service(CoyoteAdapter.java:298)
      at org.apache.coyote.http11.Http11Processor.process(Http11Processor.java:852)
      at org.apache.coyote.http11.Http11Protocol$Http11ConnectionHandler.process(Http11Protocol.java:588)
      at org.apache.tomcat.util.net.JIoEndpoint$Worker.run(JIoEndpoint.java:489)
      at java.lang.Thread.run(Thread.java:619)
      Caused by: org.alfresco.scripts.ScriptException: 08010003 Failed to execute script 'classpath*:alfresco/templates/webscripts/org/alfresco/cmis/children.post.atom.js': com.ctc.wstx.exc.WstxUnexpectedCharException: Illegal character (NULL, unicode 0) encountered: not valid in any content
      at [row,col

      {unknown-source}]: [1,2093905]
      at org.alfresco.repo.jscript.RhinoScriptProcessor.execute(RhinoScriptProcessor.java:194)
      at org.alfresco.repo.processor.ScriptServiceImpl.executeScript(ScriptServiceImpl.java:282)
      at org.alfresco.repo.web.scripts.RepositoryScriptProcessor.executeScript(RepositoryScriptProcessor.java:102)
      at org.springframework.extensions.webscripts.AbstractWebScript.executeScript(AbstractWebScript.java:981)
      at org.springframework.extensions.webscripts.DeclarativeWebScript.execute(DeclarativeWebScript.java:86)
      ... 24 more
      Caused by: org.apache.abdera.parser.ParseException: com.ctc.wstx.exc.WstxUnexpectedCharException: Illegal character (NULL, unicode 0) encountered: not valid in any content
      at [row,col {unknown-source}

      ]: [1,2093905]
      at org.apache.abdera.parser.stax.FOMBuilder.next(FOMBuilder.java:260)
      at org.apache.axiom.om.impl.llom.OMElementImpl.getNextOMSibling(OMElementImpl.java:265)
      at org.apache.axiom.om.impl.traverse.OMChildrenQNameIterator.hasNext(OMChildrenQNameIterator.java:69)
      at org.apache.axiom.om.impl.llom.OMElementImpl.getFirstChildWithName(OMElementImpl.java:223)
      at org.apache.abdera.parser.stax.FOMExtensibleElement.getExtension(FOMExtensibleElement.java:91)
      at sun.reflect.NativeMethodAccessorImpl.invoke0(Native Method)
      at sun.reflect.NativeMethodAccessorImpl.invoke(NativeMethodAccessorImpl.java:39)
      at sun.reflect.DelegatingMethodAccessorImpl.invoke(DelegatingMethodAccessorImpl.java:25)
      at java.lang.reflect.Method.invoke(Method.java:597)
      at org.mozilla.javascript.MemberBox.invoke(MemberBox.java:155)
      at org.mozilla.javascript.NativeJavaMethod.call(NativeJavaMethod.java:243)
      at org.mozilla.javascript.optimizer.OptRuntime.call1(OptRuntime.java:66)
      at org.mozilla.javascript.gen.c4._c0(file:/home/viavansi/Desarrollo/alfresco-3.4.d/tomcat/webapps/alfresco/WEB-INF/classes/alfresco/templates/webscripts/org/alfresco/cmis/children.post.atom.js:541)
      at org.mozilla.javascript.gen.c4.call(file:/home/viavansi/Desarrollo/alfresco-3.4.d/tomcat/webapps/alfresco/WEB-INF/classes/alfresco/templates/webscripts/org/alfresco/cmis/children.post.atom.js)
      at org.mozilla.javascript.ContextFactory.doTopCall(ContextFactory.java:393)
      at org.mozilla.javascript.ScriptRuntime.doTopCall(ScriptRuntime.java:2834)
      at org.mozilla.javascript.gen.c4.call(file:/home/viavansi/Desarrollo/alfresco-3.4.d/tomcat/webapps/alfresco/WEB-INF/classes/alfresco/templates/webscripts/org/alfresco/cmis/children.post.atom.js)
      at org.mozilla.javascript.gen.c4.exec(file:/home/viavansi/Desarrollo/alfresco-3.4.d/tomcat/webapps/alfresco/WEB-INF/classes/alfresco/templates/webscripts/org/alfresco/cmis/children.post.atom.js)
      at org.alfresco.repo.jscript.RhinoScriptProcessor.executeScriptImpl(RhinoScriptProcessor.java:472)
      at org.alfresco.repo.jscript.RhinoScriptProcessor.execute(RhinoScriptProcessor.java:190)
      ... 28 more
      Caused by: com.ctc.wstx.exc.WstxUnexpectedCharException: Illegal character (NULL, unicode 0) encountered: not valid in any content
      at [row,col

      {unknown-source}

      ]: [1,2093905]
      at com.ctc.wstx.sr.StreamScanner.constructNullCharException(StreamScanner.java:615)
      at com.ctc.wstx.sr.StreamScanner.throwInvalidSpace(StreamScanner.java:644)
      at com.ctc.wstx.sr.BasicStreamReader.readTextSecondary(BasicStreamReader.java:4666)
      at com.ctc.wstx.sr.BasicStreamReader.readCoalescedText(BasicStreamReader.java:4124)
      at com.ctc.wstx.sr.BasicStreamReader.finishToken(BasicStreamReader.java:3699)
      at com.ctc.wstx.sr.BasicStreamReader.safeFinishToken(BasicStreamReader.java:3647)
      at com.ctc.wstx.sr.BasicStreamReader.getText(BasicStreamReader.java:809)
      at org.apache.axiom.om.impl.builder.StAXBuilder.createOMText(StAXBuilder.java:245)
      at org.apache.axiom.om.impl.builder.StAXBuilder.createOMText(StAXBuilder.java:216)
      at org.apache.abdera.parser.stax.FOMBuilder.applyTextFilter(FOMBuilder.java:158)
      at org.apache.abdera.parser.stax.FOMBuilder.next(FOMBuilder.java:206)
      ... 47 more}}

      I've tried with the versions 0.4.0, 0.3.0 and 0.2.0 with the same error, but with 0.1.0 I can upload the same file that fail with the other versions.

      Regards,
      Eduardo Fernández.

        Attachments

          Activity

            People

            • Assignee:
              Unassigned
              Reporter:
              efernandez Eduardo Fernández León
            • Votes:
              0 Vote for this issue
              Watchers:
              0 Start watching this issue

              Dates

              • Created:
                Updated:
                Resolved: