Uploaded image for project: 'Cassandra'
  1. Cassandra
  2. CASSANDRA-15185

Update log path quilt patch for 4.0; dpatch patch for 3.11, 3.0

    XMLWordPrintableJSON

    Details

    • Type: Task
    • Status: Resolved
    • Priority: High
    • Resolution: Fixed
    • Fix Version/s: 4.0
    • Component/s: Build, Packaging
    • Labels:
      None

      Description

      (trunk)mshuler@hana:~/git/cassandra$ dpkg-buildpackage -uc -us
      <...>
      dpkg-source: info: building cassandra in cassandra_4.0.dsc
       debian/rules build
      QUILT_PATCHES=debian/patches \
              quilt --quiltrc /dev/null push -a || test $? = 2
      Applying patch cassandra_logdir_fix.diff
      patching file bin/cassandra
      Hunk #1 FAILED at 171.
      1 out of 1 hunk FAILED -- rejects in file bin/cassandra
      patching file conf/cassandra-env.sh
      Patch cassandra_logdir_fix.diff does not apply (enforce with -f)
      make: *** [/usr/share/quilt/quilt.make:18: debian/stamp-patched] Error 1
      dpkg-buildpackage: error: debian/rules build subprocess returned exit status 2
      

        Attachments

          Issue Links

            Activity

              People

              • Assignee:
                mshuler Michael Shuler
                Reporter:
                mshuler Michael Shuler
                Authors:
                Michael Shuler
                Reviewers:
                Jon Haddad
              • Votes:
                0 Vote for this issue
                Watchers:
                1 Start watching this issue

                Dates

                • Created:
                  Updated:
                  Resolved: