Uploaded image for project: 'Camel'
  1. Camel
  2. CAMEL-8985

camel-jetty - A test fails

    XMLWordPrintableJSON

    Details

    • Type: Test
    • Status: Resolved
    • Priority: Major
    • Resolution: Fixed
    • Affects Version/s: 2.16.0
    • Fix Version/s: 2.16.0
    • Component/s: camel-jetty
    • Labels:
      None
    • Estimated Complexity:
      Unknown

      Description

      Tests run: 2, Failures: 1, Errors: 0, Skipped: 0, Time elapsed: 2.341 sec <<< FAILURE! - in org.apache.camel.component.jetty.HttpStreamCacheFileTest
      testStreamCacheToFileShouldBeDeletedInCaseOfException(org.apache.camel.component.jetty.HttpStreamCacheFileTest) Time elapsed: 0.165 sec <<< FAILURE!
      java.lang.AssertionError: Should have thrown an exception
      at org.junit.Assert.fail(Assert.java:88)
      at org.apache.camel.component.jetty.HttpStreamCacheFileTest.testStreamCacheToFileShouldBeDeletedInCaseOfException(HttpStreamCacheFileTest.java:61)

        Attachments

          Activity

            People

            • Assignee:
              davsclaus Claus Ibsen
              Reporter:
              davsclaus Claus Ibsen
            • Votes:
              0 Vote for this issue
              Watchers:
              1 Start watching this issue

              Dates

              • Created:
                Updated:
                Resolved: