Uploaded image for project: 'Camel'
  1. Camel
  2. CAMEL-6125

OSGi test failures on Karaf 2.3.1

    Details

    • Type: Task
    • Status: Resolved
    • Priority: Major
    • Resolution: Fixed
    • Affects Version/s: None
    • Fix Version/s: 2.11.0
    • Component/s: osgi, tests
    • Labels:
      None
    • Estimated Complexity:
      Unknown

      Description

      Upgraded to Karaf 2.3.1, and ran the osgi tests in camel-itest-osgi. And the following fails

      davsclaus:~/workspace/camel/tests/camel-itest-osgi/target/surefire-reports$ find *.txt | xargs grep FAIL
      org.apache.camel.itest.osgi.cache.CacheManagerFactoryRefTest.txt:Tests run: 1, Failures: 1, Errors: 0, Skipped: 0, Time elapsed: 10.782 sec <<< FAILURE!
      org.apache.camel.itest.osgi.cache.CacheManagerFactoryRefTest.txt:testCache:org.apache.camel.itest.osgi.cache.CacheManagerFactoryRefTest.testCache:KarafTestContainer{mvn:org.apache.karaf/apache-karaf/2.3.1/tar.gz}(org.apache.camel.itest.osgi.cache.CacheManagerFactoryRefTest)  Time elapsed: 10.19 sec  <<< FAILURE!
      org.apache.camel.itest.osgi.cache.CacheRoutesManagementTest.txt:Tests run: 1, Failures: 1, Errors: 0, Skipped: 0, Time elapsed: 9.39 sec <<< FAILURE!
      org.apache.camel.itest.osgi.cache.CacheRoutesManagementTest.txt:testCache:org.apache.camel.itest.osgi.cache.CacheRoutesManagementTest.testCache:KarafTestContainer{mvn:org.apache.karaf/apache-karaf/2.3.1/tar.gz}(org.apache.camel.itest.osgi.cache.CacheRoutesManagementTest)  Time elapsed: 8.8 sec  <<< FAILURE!
      org.apache.camel.itest.osgi.cache.CacheTest.txt:Tests run: 1, Failures: 1, Errors: 0, Skipped: 0, Time elapsed: 10.348 sec <<< FAILURE!
      org.apache.camel.itest.osgi.cache.CacheTest.txt:testCache:org.apache.camel.itest.osgi.cache.CacheTest.testCache:KarafTestContainer{mvn:org.apache.karaf/apache-karaf/2.3.1/tar.gz}(org.apache.camel.itest.osgi.cache.CacheTest)  Time elapsed: 9.579 sec  <<< FAILURE!
      org.apache.camel.itest.osgi.jclouds.BlobStoreBlueprintRouteTest.txt:Tests run: 1, Failures: 0, Errors: 1, Skipped: 0, Time elapsed: 12.413 sec <<< FAILURE!
      org.apache.camel.itest.osgi.jclouds.BlobStoreRouteTest.txt:Tests run: 1, Failures: 0, Errors: 1, Skipped: 0, Time elapsed: 11.859 sec <<< FAILURE!
      org.apache.camel.itest.osgi.servlet.ServletComponentTest.txt:Tests run: 1, Failures: 0, Errors: 1, Skipped: 0, Time elapsed: 18.594 sec <<< FAILURE!
      org.apache.camel.itest.osgi.servlet.ServletServicesTest.txt:Tests run: 1, Failures: 0, Errors: 1, Skipped: 0, Time elapsed: 17.807 sec <<< FAILURE!
      

        Attachments

          Activity

            People

            • Assignee:
              davsclaus Claus Ibsen
              Reporter:
              davsclaus Claus Ibsen
            • Votes:
              0 Vote for this issue
              Watchers:
              1 Start watching this issue

              Dates

              • Created:
                Updated:
                Resolved: