Details

    • Type: Bug Bug
    • Status: Resolved
    • Priority: Major Major
    • Resolution: Fixed
    • Affects Version/s: 2.7.5
    • Fix Version/s: 2.7.5
    • Component/s: osgi
    • Labels:
      None
    • Estimated Complexity:
      Unknown

      Description

      Christian-Muellers-MacBook-Pro:karaf cmueller$ mvn clean install -Pvalidate
      [INFO] Scanning for projects...
      [INFO] ------------------------------------------------------------------------
      [INFO] Reactor Build Order:
      [INFO]
      [INFO] Camel :: Platforms :: Apache Karaf
      [INFO] Camel :: Platforms :: Apache Karaf :: Features
      [INFO]
      [INFO] ------------------------------------------------------------------------
      [INFO] Building Camel :: Platforms :: Apache Karaf 2.7.5-SNAPSHOT
      [INFO] ------------------------------------------------------------------------
      [INFO]
      ...
      Downloading: http://repo1.maven.org/maven2/org/apache/servicemix/bundles/org.apache.servicemix.bundles.commons-pool/$

      {commons-pool-bundle-version}/org.apache.servicemix.bundles.commons-pool-${commons-pool-bundle-version}

      .jar
      [INFO] ------------------------------------------------------------------------
      [INFO] Reactor Summary:
      [INFO]
      [INFO] Camel :: Platforms :: Apache Karaf ................ SUCCESS [2.066s]
      [INFO] Camel :: Platforms :: Apache Karaf :: Features .... FAILURE [1:17.335s]
      [INFO] ------------------------------------------------------------------------
      [INFO] BUILD FAILURE
      [INFO] ------------------------------------------------------------------------
      [INFO] Total time: 1:20.222s
      [INFO] Finished at: Mon Dec 12 22:12:52 CET 2011
      [INFO] Final Memory: 12M/81M
      [INFO] ------------------------------------------------------------------------
      [ERROR] Failed to execute goal org.apache.karaf.tooling:features-maven-plugin:2.2.2:validate (validate) on project apache-camel: Unable to validate /Users/cmueller/workspaceCamel/camel/platforms/karaf/features/target/classes/features.xml: Could not find artifact org.apache.servicemix.bundles:org.apache.servicemix.bundles.commons-pool:jar:$

      {commons-pool-bundle-version}

      in central (http://repo1.maven.org/maven2)
      [ERROR]

        Activity

        Hide
        Willem Jiang added a comment -

        Applied patch into camel-2.7.x.

        Show
        Willem Jiang added a comment - Applied patch into camel-2.7.x.

          People

          • Assignee:
            Willem Jiang
            Reporter:
            Christian Müller
          • Votes:
            0 Vote for this issue
            Watchers:
            0 Start watching this issue

            Dates

            • Created:
              Updated:
              Resolved:

              Development