Uploaded image for project: 'Camel'
  1. Camel
  2. CAMEL-13943

Camel-kafka Test cases getting failed

    XMLWordPrintableJSON

    Details

    • Type: Test
    • Status: Resolved
    • Priority: Minor
    • Resolution: Fixed
    • Affects Version/s: 3.0.0.RC1
    • Fix Version/s: 3.0.0.RC2
    • Component/s: camel-kafka
    • Labels:
      None
    • Estimated Complexity:
      Unknown

      Description

      ERROR] Failures: 
      [ERROR] org.apache.camel.component.kafka.KafkaConsumerOffsetRepositoryResumeTest.shouldResumeFromAnyParticularOffset(org.apache.camel.component.kafka.KafkaConsumerOffsetRepositoryResumeTest)
      [ERROR]   Run 1: KafkaConsumerOffsetRepositoryResumeTest.shouldResumeFromAnyParticularOffset:77->Assert.assertEquals:115 partition-0 expected:<[4]> but was:<[2]>
      [ERROR]   Run 2: KafkaConsumerOffsetRepositoryResumeTest.shouldResumeFromAnyParticularOffset:77->Assert.assertEquals:115 partition-0 expected:<[4]> but was:<[2]>
      [ERROR]   Run 3: KafkaConsumerOffsetRepositoryResumeTest.shouldResumeFromAnyParticularOffset:77->Assert.assertEquals:115 partition-0 expected:<[4]> but was:<[2]>
      [INFO] 
      [WARNING] Flakes: 
      [WARNING] org.apache.camel.component.kafka.KafkaConsumerOffsetRepositoryEmptyTest.shouldStartFromBeginningWithEmptyOffsetRepository(org.apache.camel.component.kafka.KafkaConsumerOffsetRepositoryEmptyTest)
      [ERROR]   Run 1: KafkaConsumerOffsetRepositoryEmptyTest.shouldStartFromBeginningWithEmptyOffsetRepository:78->Assert.assertEquals:118->Assert.failNotEquals:834->Assert.fail:88 partition-1 expected:<4> but was:<null>
      [ERROR]   Run 2: KafkaConsumerOffsetRepositoryEmptyTest.shouldStartFromBeginningWithEmptyOffsetRepository:77->Assert.assertEquals:118->Assert.failNotEquals:834->Assert.fail:88 partition-0 expected:<4> but was:<null>
      [INFO]   Run 3: PASS
      [INFO] 
      [INFO] 
      [ERROR] Tests run: 61, Failures: 1, Errors: 0, Skipped: 3, Flakes: 1
      [INFO] 
      
      

        Attachments

          Issue Links

            Activity

              People

              • Assignee:
                acosentino Andrea Cosentino
                Reporter:
                ramu11 Ramu
              • Votes:
                0 Vote for this issue
                Watchers:
                2 Start watching this issue

                Dates

                • Created:
                  Updated:
                  Resolved:

                  Time Tracking

                  Estimated:
                  Original Estimate - Not Specified
                  Not Specified
                  Remaining:
                  Remaining Estimate - 0h
                  0h
                  Logged:
                  Time Spent - 20m
                  20m