Uploaded image for project: 'Camel'
  1. Camel
  2. CAMEL-12300

camel-example - AMQP blueprint fails test

    XMLWordPrintableJSON

    Details

    • Type: Test
    • Status: Resolved
    • Priority: Major
    • Resolution: Fixed
    • Affects Version/s: 2.21.0
    • Fix Version/s: 2.21.0
    • Component/s: examples
    • Labels:
      None
    • Estimated Complexity:
      Unknown

      Description

      [ERROR] Errors:
      [ERROR] org.apache.camel.example.artemis.amqp.ArtemisAmqpTest.testEmbeddedBroker(org.apache.camel.example.artemis.amqp.ArtemisAmqpTest)
      [ERROR] Run 1: ArtemisAmqpTest.testEmbeddedBroker:51 » CamelExecution Exception occurred duri...
      [ERROR] Run 2: ArtemisAmqpTest.testEmbeddedBroker:51 » CamelExecution Exception occurred duri...
      [ERROR] Run 3: ArtemisAmqpTest.testEmbeddedBroker:51 » CamelExecution Exception occurred duri...
      [INFO]
      [INFO]
      [ERROR] Tests run: 1, Failures: 0, Errors: 1, Skipped: 0

       

      [INFO] Camel :: Example :: ActiveMQ Artemis AMQP :: Blueprint FAILURE [ 11.462 s]

        Attachments

          Issue Links

            Activity

              People

              • Assignee:
                davsclaus Claus Ibsen
                Reporter:
                davsclaus Claus Ibsen
              • Votes:
                0 Vote for this issue
                Watchers:
                2 Start watching this issue

                Dates

                • Created:
                  Updated:
                  Resolved: