Uploaded image for project: 'Camel'
  1. Camel
  2. CAMEL-11942

camel-spring build failure on windows

    XMLWordPrintableJSON

    Details

    • Type: Task
    • Status: Resolved
    • Priority: Minor
    • Resolution: Fixed
    • Affects Version/s: 2.20.0
    • Fix Version/s: 2.21.0
    • Component/s: build system
    • Labels:
      None
    • Estimated Complexity:
      Novice

      Description

      [INFO] Executed tasks
      [INFO]
      [INFO] — exec-maven-plugin:1.1.1:exec (generate schema) @ camel-spring —
      [INFO] ------------------------------------------------------------------------
      [INFO] BUILD FAILURE
      [INFO] ------------------------------------------------------------------------
      [INFO] Total time: 03:33 min
      [INFO] Finished at: 2017-10-24T10:27:33+03:00
      [INFO] Final Memory: 37M/240M
      [INFO] ------------------------------------------------------------------------
      [ERROR] Failed to execute goal org.codehaus.mojo:exec-maven-plugin:1.1.1:exec (g
      enerate schema) on project camel-spring: Command execution failed. Error while e
      xecuting process. Cannot run program "cmd.exe" (in directory "D:\dev\github\came
      l\components\camel-spring"): CreateProcess error=206, The filename or extension
      is too long -> [Help 1]
      [ERROR]

        Attachments

          Activity

            People

            • Assignee:
              Unassigned
              Reporter:
              onders Onder Sezgin
            • Votes:
              0 Vote for this issue
              Watchers:
              4 Start watching this issue

              Dates

              • Created:
                Updated:
                Resolved: