Uploaded image for project: 'Camel'
  1. Camel
  2. CAMEL-11760

camel-itest-karaf - CamelServicenowTest fails

    XMLWordPrintableJSON

Details

    • Bug
    • Status: Resolved
    • Major
    • Resolution: Fixed
    • 2.20.0
    • 2.20.0
    • camel-servicenow, karaf, tests
    • None
    • Unknown

    Description

      $ ./run-tests.sh CamelServicenowTest
      ...
      Tests run: 1, Failures: 0, Errors: 1, Skipped: 0, Time elapsed: 8.451 sec <<< FAILURE! - in org.apache.camel.itest.karaf.CamelServicenowTest
      test(org.apache.camel.itest.karaf.CamelServicenowTest)  Time elapsed: 8.357 sec  <<< ERROR!
      org.ops4j.pax.exam.WrappedTestContainerException: [test(org.apache.camel.itest.karaf.CamelServicenowTest): Unable to resolve root: missing requirement [root] osgi.identity; osgi.identity=camel-servicenow; type=karaf.feature; version="[2.20.0.SNAPSHOT,2.20.0.SNAPSHOT]"; filter:="(&(osgi.identity=camel-servicenow)(type=karaf.feature)(version>=2.20.0.SNAPSHOT)(version<=2.20.0.SNAPSHOT))" [caused by: Unable to resolve camel-servicenow/2.20.0.SNAPSHOT: missing requirement [camel-servicenow/2.20.0.SNAPSHOT] osgi.identity; osgi.identity=org.apache.camel.camel-servicenow; type=osgi.bundle; version="[2.20.0.SNAPSHOT,2.20.0.SNAPSHOT]"; resolution:=mandatory [caused by: Unable to resolve org.apache.camel.camel-servicenow/2.20.0.SNAPSHOT: missing requirement [org.apache.camel.camel-servicenow/2.20.0.SNAPSHOT] osgi.wiring.package; filter:="(&(osgi.wiring.package=com.fasterxml.jackson.datatype.jdk8)(version>=2.8.0)(!(version>=3.0.0)))"]]]
      	at org.apache.felix.resolver.ResolutionError.toException(ResolutionError.java:42)
      	at org.apache.felix.resolver.ResolverImpl.doResolve(ResolverImpl.java:389)
      	at org.apache.felix.resolver.ResolverImpl.resolve(ResolverImpl.java:375)
      	at org.apache.felix.resolver.ResolverImpl.resolve(ResolverImpl.java:347)
      	at org.apache.karaf.features.internal.region.SubsystemResolver.resolve(SubsystemResolver.java:218)
      	at org.apache.karaf.features.internal.service.Deployer.deploy(Deployer.java:285)
      	at org.apache.karaf.features.internal.service.FeaturesServiceImpl.doProvision(FeaturesServiceImpl.java:1170)
      	at org.apache.karaf.features.internal.service.FeaturesServiceImpl.lambda$doProvisionInThread$0(FeaturesServiceImpl.java:1069)
      	at java.util.concurrent.FutureTask.run(FutureTask.java:266)
      	at java.util.concurrent.ThreadPoolExecutor.runWorker(ThreadPoolExecutor.java:1142)
      	at java.util.concurrent.ThreadPoolExecutor$Worker.run(ThreadPoolExecutor.java:617)
      	at java.lang.Thread.run(Thread.java:748)
      
      
      Results :
      
      Tests in error: 
        CamelServicenowTest.test ยป WrappedTestContainer [test(org.apache.camel.itest.k...
      
      Tests run: 1, Failures: 0, Errors: 1, Skipped: 0
      
      [INFO] ------------------------------------------------------------------------
      [INFO] BUILD FAILURE
      [INFO] ------------------------------------------------------------------------
      [INFO] Total time: 12.999 s
      [INFO] Finished at: 2017-09-07T12:24:28+09:00
      [INFO] Final Memory: 41M/2875M
      [INFO] ------------------------------------------------------------------------
      

      Attachments

        Issue Links

          Activity

            People

              tadayosi Tadayoshi Sato
              tadayosi Tadayoshi Sato
              Votes:
              0 Vote for this issue
              Watchers:
              3 Start watching this issue

              Dates

                Created:
                Updated:
                Resolved: