Uploaded image for project: 'Camel'
  1. Camel
  2. CAMEL-11602

camel-cxf - there are failing test cases on Windows

    XMLWordPrintableJSON

    Details

    • Type: Test
    • Status: Resolved
    • Priority: Trivial
    • Resolution: Fixed
    • Affects Version/s: 2.19.1, 2.20.0
    • Fix Version/s: 2.20.0
    • Component/s: camel-cxf
    • Labels:
      None
    • Environment:

      windows

    • Estimated Complexity:
      Unknown

      Description

      [ERROR] Failures:
      [ERROR] CxfProducerRouterTest.testCannotSendRequest:98 mock://error Received m
      essage count. Expected: <1> but was: <0>
      [ERROR] Errors:
      [ERROR] CxfProducerRouterTest.startServer:67 » Runtime Soap 1.1 endpoint alrea
      dy regis...
      [ERROR] org.apache.camel.component.cxf.CxfProducerSoapActionTest.testSendSoapReq
      uestWithoutSoapActionSet(org.apache.camel.component.cxf.CxfProducerSoapActionTes
      t)
      [ERROR] Run 1: CxfProducerSoapActionTest>CamelTestSupport.setUp:262->CamelTest
      Support.doSetUp:361->CamelTestSupport.startCamelContext:678 » Fault
      [ERROR] Run 2: CxfProducerSoapActionTest>CamelTestSupport.setUp:262->CamelTest
      Support.doSetUp:361->CamelTestSupport.startCamelContext:678 » Fault
      [ERROR] Run 3: CxfProducerSoapActionTest>CamelTestSupport.setUp:262->CamelTest
      Support.doSetUp:361->CamelTestSupport.startCamelContext:678 » Fault
      [INFO]
      [INFO]
      [ERROR] Tests run: 460, Failures: 1, Errors: 2, Skipped: 2

        Attachments

          Issue Links

            Activity

              People

              • Assignee:
                onders Onder Sezgin
                Reporter:
                onders Onder Sezgin
              • Votes:
                0 Vote for this issue
                Watchers:
                3 Start watching this issue

                Dates

                • Created:
                  Updated:
                  Resolved: