Details

    • Type: Bug
    • Status: Closed
    • Priority: Major
    • Resolution: Fixed
    • Affects Version/s: 0.3.0
    • Fix Version/s: 0.3.0
    • Component/s: rpm
    • Labels:
      None

      Description

      00:12:59  Processing files: oozie-3.1.3.20120306000746-1.noarch
      00:12:59  error: File not found: /home/jenkins/workspace/BigTop-Oozie-Fedora/build/oozie/rpm/BUILDROOT/oozie-3.1.3.20120306000746-1.x86_64/usr/lib/oozie/bin/oozie-env.sh
      00:12:59  error: File not found: /home/jenkins/workspace/BigTop-Oozie-Fedora/build/oozie/rpm/BUILDROOT/oozie-3.1.3.20120306000746-1.x86_64/usr/lib/oozie/bin/ooziedb.sh
      00:12:59  error: File not found: /home/jenkins/workspace/BigTop-Oozie-Fedora/build/oozie/rpm/BUILDROOT/oozie-3.1.3.20120306000746-1.x86_64/usr/lib/oozie/webapps
      00:12:59  error: File not found: /home/jenkins/workspace/BigTop-Oozie-Fedora/build/oozie/rpm/BUILDROOT/oozie-3.1.3.20120306000746-1.x86_64/usr/lib/oozie/libtools
      00:12:59  error: File not found: /home/jenkins/workspace/BigTop-Oozie-Fedora/build/oozie/rpm/BUILDROOT/oozie-3.1.3.20120306000746-1.x86_64/usr/lib/oozie/oozie-sharelib.tar.gz
      00:12:59  error: File not found: /home/jenkins/workspace/BigTop-Oozie-Fedora/build/oozie/rpm/BUILDROOT/oozie-3.1.3.20120306000746-1.x86_64/usr/lib/oozie/oozie-server
      00:12:59  error: File not found: /home/jenkins/workspace/BigTop-Oozie-Fedora/build/oozie/rpm/BUILDROOT/oozie-3.1.3.20120306000746-1.x86_64/etc/rc.d/init.d/oozie
      00:12:59  
      00:12:59  
      00:12:59  RPM build errors:
      00:12:59      File not found: /home/jenkins/workspace/BigTop-Oozie-Fedora/build/oozie/rpm/BUILDROOT/oozie-3.1.3.20120306000746-1.x86_64/usr/lib/oozie/bin/oozie-env.sh
      00:12:59      File not found: /home/jenkins/workspace/BigTop-Oozie-Fedora/build/oozie/rpm/BUILDROOT/oozie-3.1.3.20120306000746-1.x86_64/usr/lib/oozie/bin/ooziedb.sh
      00:12:59      File not found: /home/jenkins/workspace/BigTop-Oozie-Fedora/build/oozie/rpm/BUILDROOT/oozie-3.1.3.20120306000746-1.x86_64/usr/lib/oozie/webapps
      00:12:59      File not found: /home/jenkins/workspace/BigTop-Oozie-Fedora/build/oozie/rpm/BUILDROOT/oozie-3.1.3.20120306000746-1.x86_64/usr/lib/oozie/libtools
      00:12:59      File not found: /home/jenkins/workspace/BigTop-Oozie-Fedora/build/oozie/rpm/BUILDROOT/oozie-3.1.3.20120306000746-1.x86_64/usr/lib/oozie/oozie-sharelib.tar.gz
      00:12:59      File not found: /home/jenkins/workspace/BigTop-Oozie-Fedora/build/oozie/rpm/BUILDROOT/oozie-3.1.3.20120306000746-1.x86_64/usr/lib/oozie/oozie-server
      00:12:59      File not found: /home/jenkins/workspace/BigTop-Oozie-Fedora/build/oozie/rpm/BUILDROOT/oozie-3.1.3.20120306000746-1.x86_64/etc/rc.d/init.d/oozie
      00:12:59  make: *** [/home/jenkins/workspace/BigTop-Oozie-Fedora/build/oozie//.rpm] Error 1
      00:12:59  Build step 'Execute shell' marked build as failure
      00:12:59  [WARNINGS] Skipping publisher since build result is FAILURE
      00:12:59  Archiving artifacts
      00:13:05  Notifying upstream projects of job completion
      00:13:05  Finished: FAILURE
      

        Attachments

          Activity

            People

            • Assignee:
              rvs Roman Shaposhnik
              Reporter:
              bmahe Bruno Mahé
            • Votes:
              0 Vote for this issue
              Watchers:
              0 Start watching this issue

              Dates

              • Created:
                Updated:
                Resolved: