Uploaded image for project: 'Bigtop'
  1. Bigtop
  2. BIGTOP-3574

Starting Elasticsearch fails on ppc64le

    XMLWordPrintableJSON

Details

    • Bug
    • Status: Resolved
    • Major
    • Resolution: Fixed
    • None
    • 3.0.0
    • deployment
    • None

    Description

      A follow-up issue for BIGTOP-3561. Running Kibana smoke test fails on ppc64le as follows.

      jenkins@bigtop1slave:~/bigtop/provisioner/docker$ ./docker-hadoop.sh -d --create 1 --image bigtop/puppet:trunk-centos-7 --repo file:///bigtop-home/output --disable-gpg-check --stack elasticsearch,kibana --smoke-tests kibana
      
      ...
      
      > Task :bigtop-tests:smoke-tests:kibana:test
      Downloading https://repo.maven.apache.org/maven2/javax/servlet/jsp/jsp-api/2.1/jsp-api-2.1.pom to /tmp/gradle_download6085623579795490524bin
      Downloading https://repo.maven.apache.org/maven2/org/slf4j/slf4j-log4j12/1.7.10/slf4j-log4j12-1.7.10.pom to /tmp/gradle_download5416887246029888310bin
      Downloading https://repo.maven.apache.org/maven2/org/slf4j/slf4j-log4j12/1.7.10/slf4j-log4j12-1.7.10.jar to /tmp/gradle_download2129537405375150222bin
      Downloading https://repo.maven.apache.org/maven2/javax/servlet/jsp/jsp-api/2.1/jsp-api-2.1.jar to /tmp/gradle_download5704462740017823103bin
      Caching disabled for task ':bigtop-tests:smoke-tests:kibana:test' because:
        Build cache is disabled
      Task ':bigtop-tests:smoke-tests:kibana:test' is not up-to-date because:
        No history is available.
      Starting process 'Gradle Test Executor 2'. Working directory: /bigtop-home/bigtop-tests/smoke-tests/kibana Command: /usr/lib/jvm/java-1.8.0-openjdk-1.8.0.292.b10-1.el7_9.ppc64le/bin/java -Dawt.toolkit=sun.awt.X11.XToolkit -Dfile.encoding.pkg=sun.io -Dfile.separator=/ -Djava.awt.graphicsenv=sun.awt.X11GraphicsEnvironment -Djava.awt.printerjob=sun.print.PSPrinterJob -Djava.class.path=/root/.gradle/wrapper/dists/gradle-5.6.4-bin/c9880aa85176bf8c458862eb99f7e0a9/gradle-5.6.4/lib/gradle-launcher-5.6.4.jar -Djava.class.version=52.0 -Djava.endorsed.dirs=/usr/lib/jvm/java-1.8.0-openjdk-1.8.0.292.b10-1.el7_9.ppc64le/jre/lib/endorsed -Djava.ext.dirs=/usr/lib/jvm/java-1.8.0-openjdk-1.8.0.292.b10-1.el7_9.ppc64le/jre/lib/ext:/usr/java/packages/lib/ext -Djava.home=/usr/lib/jvm/java-1.8.0-openjdk-1.8.0.292.b10-1.el7_9.ppc64le/jre -Djava.library.path=/usr/java/packages/lib/ppc64le:/usr/lib64:/lib64:/lib:/usr/lib -Djava.runtime.name=OpenJDK Runtime Environment -Djava.runtime.version=1.8.0_292-b10 -Djava.security.manager=worker.org.gradle.process.internal.worker.child.BootstrapSecurityManager -Djava.specification.name=Java Platform API Specification -Djava.specification.vendor=Oracle Corporation -Djava.specification.version=1.8 -Djava.vendor=Red Hat, Inc. -Djava.vendor.url=https://www.redhat.com/ -Djava.vendor.url.bug=https://bugzilla.redhat.com/enter_bug.cgi?product=Red%20Hat%20Enterprise%20Linux%207&component=java-1.8.0-openjdk -Djava.version=1.8.0_292 -Djava.vm.info=mixed mode -Djava.vm.name=OpenJDK 64-Bit Server VM -Djava.vm.specification.name=Java Virtual Machine Specification -Djava.vm.specification.vendor=Oracle Corporation -Djava.vm.specification.version=1.8 -Djava.vm.vendor=Red Hat, Inc. -Djava.vm.version=25.292-b10 -Dlibrary.jansi.path=/root/.gradle/native/jansi/1.17.1/linux64 -Dline.separator=
       -Dorg.gradle.appname=gradlew -Dorg.gradle.native=false -Dos.arch=ppc64le -Dos.name=Linux -Dos.version=5.4.0-70-generic -Dpath.separator=: -Dsun.arch.data.model=64 -Dsun.boot.class.path=/usr/lib/jvm/java-1.8.0-openjdk-1.8.0.292.b10-1.el7_9.ppc64le/jre/lib/resources.jar:/usr/lib/jvm/java-1.8.0-openjdk-1.8.0.292.b10-1.el7_9.ppc64le/jre/lib/rt.jar:/usr/lib/jvm/java-1.8.0-openjdk-1.8.0.292.b10-1.el7_9.ppc64le/jre/lib/sunrsasign.jar:/usr/lib/jvm/java-1.8.0-openjdk-1.8.0.292.b10-1.el7_9.ppc64le/jre/lib/jsse.jar:/usr/lib/jvm/java-1.8.0-openjdk-1.8.0.292.b10-1.el7_9.ppc64le/jre/lib/jce.jar:/usr/lib/jvm/java-1.8.0-openjdk-1.8.0.292.b10-1.el7_9.ppc64le/jre/lib/charsets.jar:/usr/lib/jvm/java-1.8.0-openjdk-1.8.0.292.b10-1.el7_9.ppc64le/jre/lib/jfr.jar:/usr/lib/jvm/java-1.8.0-openjdk-1.8.0.292.b10-1.el7_9.ppc64le/jre/classes -Dsun.boot.library.path=/usr/lib/jvm/java-1.8.0-openjdk-1.8.0.292.b10-1.el7_9.ppc64le/jre/lib/ppc64le -Dsun.cpu.endian=little -Dsun.cpu.isalist -Dsun.io.unicode.encoding=UnicodeLittle -Dsun.java.command=org.gradle.launcher.daemon.bootstrap.GradleDaemon 5.6.4 -Dsun.java.launcher=SUN_STANDARD -Dsun.jnu.encoding=ANSI_X3.4-1968 -Dsun.management.compiler=HotSpot 64-Bit Server Compiler -Dsun.os.patch.level=unknown -Duser.dir=/root/.gradle/daemon/5.6.4 -Duser.home=/root -Duser.name=root -Duser.timezone -Xmx512m -Dfile.encoding=ANSI_X3.4-1968 -Djava.io.tmpdir=/tmp -Duser.country=US -Duser.language=en -Duser.variant -ea -cp /root/.gradle/caches/5.6.4/workerMain/gradle-worker.jar worker.org.gradle.process.internal.worker.GradleWorkerMain 'Gradle Test Executor 2'
      Successfully started process 'Gradle Test Executor 2'
      
      TestKibanaSmoke > KibanaWebTest STANDARD_OUT
          Failed command: /usr/lib/kibana/bin/start-kibana;sleep 10;curl -i localhost:5601;
          	error code: 7
          	stdout: [{"type":"log","@timestamp":"2021-07-26T20:14:54Z","tags":["status","plugin:kibana@5.4.1","info"],"pid":1382,"state":"green","message":"Status changed from uninitialized to green - Ready","prevState":"uninitialized","prevMsg":"uninitialized"}]
          	stderr: [  % Total    % Received % Xferd  Average Speed   Time    Time     Time  Current,                                  Dload  Upload   Total   Spent    Left  Speed, 
        0     0    0     0    0     0      0      0 --:--:-- --:--:-- --:--:--     0curl: (7) Failed connect to localhost:5601; Connection refused]
      
      Gradle Test Executor 2 finished executing tests.
      
      > Task :bigtop-tests:smoke-tests:kibana:test FAILED
      
      TestKibanaSmoke > KibanaWebTest FAILED
          java.lang.AssertionError: Kibana start failed
              at org.junit.Assert.fail(Assert.java:88)
              at org.junit.Assert.assertTrue(Assert.java:41)
              at org.junit.Assert$assertTrue.callStatic(Unknown Source)
              at org.codehaus.groovy.runtime.callsite.CallSiteArray.defaultCallStatic(CallSiteArray.java:55)
              at org.codehaus.groovy.runtime.callsite.AbstractCallSite.callStatic(AbstractCallSite.java:196)
              at org.codehaus.groovy.runtime.callsite.AbstractCallSite.callStatic(AbstractCallSite.java:216)
              at TestKibanaSmoke.KibanaWebTest(TestKibanaSmoke.groovy:49)
      
      1 test completed, 1 failedFinished generating test XML results (0.018 secs) into: /bigtop-home/bigtop-tests/smoke-tests/kibana/build/test-results/test
      Generating HTML test report...
      Finished generating test html results (0.028 secs) into: /bigtop-home/bigtop-tests/smoke-tests/kibana/build/reports/tests/test
      :bigtop-tests:smoke-tests:kibana:test (Thread[Daemon worker,5,main]) completed. Took 41.829 secs.
      
      
      FAILURE: Build failed with an exception.
      
      * What went wrong:
      Execution failed for task ':bigtop-tests:smoke-tests:kibana:test'.
      > There were failing tests. See the report at: file:///bigtop-home/bigtop-tests/smoke-tests/kibana/build/reports/tests/test/index.html
      
      * Try:
      Run with --stacktrace option to get the stack trace. Run with --debug option to get more log output. Run with --scan to get full insights.
      
      * Get more help at https://help.gradle.org
      
      BUILD FAILED in 1m 20s
      

      This is because Elasticsearch can't start due to the failure of installing system call filter.

      jenkins@bigtop1slave:~/bigtop/provisioner/docker$ docker exec -it 20210726_195549_r24048_bigtop_1 bash
      [root@979804dad51a /]# jps
      914 GradleDaemon
      1417 Jps
      [root@979804dad51a /]# systemctl start elasticsearch
      [root@979804dad51a /]# systemctl status elasticsearch
      ‚óŹ elasticsearch.service - LSB: Elasticsearch start-stop-daemon
         Loaded: loaded (/etc/rc.d/init.d/elasticsearch; bad; vendor preset: disabled)
         Active: active (exited) since Mon 2021-07-26 20:13:28 UTC; 8min ago
           Docs: man:systemd-sysv-generator(8)
        Process: 708 ExecStart=/etc/rc.d/init.d/elasticsearch start (code=exited, status=0/SUCCESS)
      
      Jul 26 20:13:18 979804dad51a systemd[1]: Starting LSB: Elasticsearch start-stop-daemon...
      Jul 26 20:13:21 979804dad51a runuser[732]: pam_unix(runuser:session): session opened for user elasticsearch by (uid=0)
      Jul 26 20:13:22 979804dad51a runuser[732]: pam_unix(runuser:session): session closed for user elasticsearch
      Jul 26 20:13:28 979804dad51a elasticsearch[708]: Starting Elasticsearch Server ...[  OK  ]
      Jul 26 20:13:28 979804dad51a systemd[1]: Started LSB: Elasticsearch start-stop-daemon.
      [root@979804dad51a /]# cat /var/log/elasticsearch/bigtop-es.log 
      [2021-07-26T20:13:27,037][WARN ][o.e.b.Natives            ] unable to load JNA native support library, native methods will be disabled.
      java.lang.UnsatisfiedLinkError: Native library (com/sun/jna/linux-ppc64le/libjnidispatch.so) not found in resource path ([file:/usr/lib/elasticsearch/lib/lucene-backward-codecs-6.6.1.jar, file:/usr/lib/elasticsearch/lib/lucene-highlighter-6.6.1.jar, file:/usr/lib/elasticsearch/lib/jackson-dataformat-yaml-2.8.6.jar, file:/usr/lib/elasticsearch/lib/lucene-memory-6.6.1.jar, file:/usr/lib/elasticsearch/lib/spatial4j-0.6.jar, file:/usr/lib/elasticsearch/lib/securesm-1.2.jar, file:/usr/lib/elasticsearch/lib/plugin-cli-5.6.14.jar, file:/usr/lib/elasticsearch/lib/jopt-simple-5.0.2.jar, file:/usr/lib/elasticsearch/lib/lucene-grouping-6.6.1.jar, file:/usr/lib/elasticsearch/lib/hppc-0.7.1.jar, file:/usr/lib/elasticsearch/lib/jackson-dataformat-smile-2.8.6.jar, file:/usr/lib/elasticsearch/lib/lucene-misc-6.6.1.jar, file:/usr/lib/elasticsearch/lib/lucene-queryparser-6.6.1.jar, file:/usr/lib/elasticsearch/lib/lucene-spatial-6.6.1.jar, file:/usr/lib/elasticsearch/lib/elasticsearch-5.6.14.jar, file:/usr/lib/elasticsearch/lib/lucene-core-6.6.1.jar, file:/usr/lib/elasticsearch/lib/lucene-spatial-extras-6.6.1.jar, file:/usr/lib/elasticsearch/lib/lucene-spatial3d-6.6.1.jar, file:/usr/lib/elasticsearch/lib/log4j-1.2-api-2.11.1.jar, file:/usr/lib/elasticsearch/lib/java-version-checker-5.6.14.jar, file:/usr/lib/elasticsearch/lib/lucene-suggest-6.6.1.jar, file:/usr/lib/elasticsearch/lib/lucene-analyzers-common-6.6.1.jar, file:/usr/lib/elasticsearch/lib/lucene-sandbox-6.6.1.jar, file:/usr/lib/elasticsearch/lib/lucene-queries-6.6.1.jar, file:/usr/lib/elasticsearch/lib/t-digest-3.0.jar, file:/usr/lib/elasticsearch/lib/lucene-join-6.6.1.jar, file:/usr/lib/elasticsearch/lib/jackson-core-2.8.6.jar, file:/usr/lib/elasticsearch/lib/log4j-core-2.11.1.jar, file:/usr/lib/elasticsearch/lib/jts-1.13.jar, file:/usr/lib/elasticsearch/lib/snakeyaml-1.15.jar, file:/usr/lib/elasticsearch/lib/joda-time-2.10.jar, file:/usr/lib/elasticsearch/lib/jackson-dataformat-cbor-2.8.6.jar, file:/usr/lib/elasticsearch/lib/jna-4.4.0-1.jar, file:/usr/lib/elasticsearch/lib/log4j-api-2.11.1.jar, file:/usr/lib/elasticsearch/lib/HdrHistogram-2.1.9.jar])
      	at com.sun.jna.Native.loadNativeDispatchLibraryFromClasspath(Native.java:962) ~[jna-4.4.0-1.jar:4.4.0 (b0)]
      	at com.sun.jna.Native.loadNativeDispatchLibrary(Native.java:922) ~[jna-4.4.0-1.jar:4.4.0 (b0)]
      	at com.sun.jna.Native.<clinit>(Native.java:190) ~[jna-4.4.0-1.jar:4.4.0 (b0)]
      	at java.lang.Class.forName0(Native Method) ~[?:1.8.0_292]
      	at java.lang.Class.forName(Class.java:264) ~[?:1.8.0_292]
      	at org.elasticsearch.bootstrap.Natives.<clinit>(Natives.java:45) [elasticsearch-5.6.14.jar:5.6.14]
      	at org.elasticsearch.bootstrap.Bootstrap.initializeNatives(Bootstrap.java:105) [elasticsearch-5.6.14.jar:5.6.14]
      	at org.elasticsearch.bootstrap.Bootstrap.setup(Bootstrap.java:195) [elasticsearch-5.6.14.jar:5.6.14]
      	at org.elasticsearch.bootstrap.Bootstrap.init(Bootstrap.java:342) [elasticsearch-5.6.14.jar:5.6.14]
      	at org.elasticsearch.bootstrap.Elasticsearch.init(Elasticsearch.java:132) [elasticsearch-5.6.14.jar:5.6.14]
      	at org.elasticsearch.bootstrap.Elasticsearch.execute(Elasticsearch.java:123) [elasticsearch-5.6.14.jar:5.6.14]
      	at org.elasticsearch.cli.EnvironmentAwareCommand.execute(EnvironmentAwareCommand.java:70) [elasticsearch-5.6.14.jar:5.6.14]
      	at org.elasticsearch.cli.Command.mainWithoutErrorHandling(Command.java:134) [elasticsearch-5.6.14.jar:5.6.14]
      	at org.elasticsearch.cli.Command.main(Command.java:90) [elasticsearch-5.6.14.jar:5.6.14]
      	at org.elasticsearch.bootstrap.Elasticsearch.main(Elasticsearch.java:91) [elasticsearch-5.6.14.jar:5.6.14]
      	at org.elasticsearch.bootstrap.Elasticsearch.main(Elasticsearch.java:84) [elasticsearch-5.6.14.jar:5.6.14]
      [2021-07-26T20:13:27,046][WARN ][o.e.b.Natives            ] cannot check if running as root because JNA is not available
      [2021-07-26T20:13:27,046][WARN ][o.e.b.Natives            ] cannot install system call filter because JNA is not available
      [2021-07-26T20:13:27,046][WARN ][o.e.b.Natives            ] cannot register console handler because JNA is not available
      [2021-07-26T20:13:27,048][WARN ][o.e.b.Natives            ] cannot getrlimit RLIMIT_NPROC because JNA is not available
      [2021-07-26T20:13:27,048][WARN ][o.e.b.Natives            ] cannot getrlimit RLIMIT_AS beacuse JNA is not available
      [2021-07-26T20:13:27,048][WARN ][o.e.b.Natives            ] cannot getrlimit RLIMIT_FSIZE because JNA is not available
      [2021-07-26T20:13:27,573][INFO ][o.e.n.Node               ] [979804dad51a] initializing ...
      [2021-07-26T20:13:28,383][INFO ][o.e.e.NodeEnvironment    ] [979804dad51a] using [1] data paths, mounts [[/ (overlay)]], net usable_space [259.1gb], net total_space [310.1gb], spins? [possibly], types [overlay]
      [2021-07-26T20:13:28,384][INFO ][o.e.e.NodeEnvironment    ] [979804dad51a] heap size [1.9gb], compressed ordinary object pointers [true]
      [2021-07-26T20:13:28,385][INFO ][o.e.n.Node               ] [979804dad51a] node name [979804dad51a], node ID [8dm4t6sNR3GwlQviXYPSCg]
      [2021-07-26T20:13:28,385][INFO ][o.e.n.Node               ] [979804dad51a] version[5.6.14], pid[767], build[aa38cbd/2021-07-26T19:19:49.824Z], OS[Linux/5.4.0-70-generic/ppc64le], JVM[Red Hat, Inc./OpenJDK 64-Bit Server VM/1.8.0_292/25.292-b10]
      [2021-07-26T20:13:28,386][INFO ][o.e.n.Node               ] [979804dad51a] JVM arguments [-Xms2g, -Xmx2g, -XX:+UseConcMarkSweepGC, -XX:CMSInitiatingOccupancyFraction=75, -XX:+UseCMSInitiatingOccupancyOnly, -XX:+AlwaysPreTouch, -Xss1m, -Djava.awt.headless=true, -Dfile.encoding=UTF-8, -Djna.nosys=true, -Djdk.io.permissionsUseCanonicalPath=true, -Dio.netty.noUnsafe=true, -Dio.netty.noKeySetOptimization=true, -Dio.netty.recycler.maxCapacityPerThread=0, -Dlog4j.shutdownHookEnabled=false, -Dlog4j2.disable.jmx=true, -Dlog4j.skipJansi=true, -XX:+HeapDumpOnOutOfMemoryError, -Des.path.home=/usr/lib/elasticsearch]
      [2021-07-26T20:13:34,926][INFO ][o.e.p.PluginsService     ] [979804dad51a] loaded module [aggs-matrix-stats]
      [2021-07-26T20:13:34,926][INFO ][o.e.p.PluginsService     ] [979804dad51a] loaded module [ingest-common]
      [2021-07-26T20:13:34,926][INFO ][o.e.p.PluginsService     ] [979804dad51a] loaded module [lang-expression]
      [2021-07-26T20:13:34,926][INFO ][o.e.p.PluginsService     ] [979804dad51a] loaded module [lang-groovy]
      [2021-07-26T20:13:34,926][INFO ][o.e.p.PluginsService     ] [979804dad51a] loaded module [lang-mustache]
      [2021-07-26T20:13:34,926][INFO ][o.e.p.PluginsService     ] [979804dad51a] loaded module [lang-painless]
      [2021-07-26T20:13:34,926][INFO ][o.e.p.PluginsService     ] [979804dad51a] loaded module [parent-join]
      [2021-07-26T20:13:34,926][INFO ][o.e.p.PluginsService     ] [979804dad51a] loaded module [percolator]
      [2021-07-26T20:13:34,926][INFO ][o.e.p.PluginsService     ] [979804dad51a] loaded module [reindex]
      [2021-07-26T20:13:34,926][INFO ][o.e.p.PluginsService     ] [979804dad51a] loaded module [transport-netty3]
      [2021-07-26T20:13:34,927][INFO ][o.e.p.PluginsService     ] [979804dad51a] loaded module [transport-netty4]
      [2021-07-26T20:13:34,927][INFO ][o.e.p.PluginsService     ] [979804dad51a] no plugins loaded
      [2021-07-26T20:13:42,114][INFO ][o.e.d.DiscoveryModule    ] [979804dad51a] using discovery type [zen]
      [2021-07-26T20:13:42,829][INFO ][o.e.n.Node               ] [979804dad51a] initialized
      [2021-07-26T20:13:42,829][INFO ][o.e.n.Node               ] [979804dad51a] starting ...
      [2021-07-26T20:13:42,981][INFO ][o.e.t.TransportService   ] [979804dad51a] publish_address {172.17.0.2:9300}, bound_addresses {0.0.0.0:9300}
      [2021-07-26T20:13:42,992][INFO ][o.e.b.BootstrapChecks    ] [979804dad51a] bound or publishing to a non-loopback address, enforcing bootstrap checks
      [2021-07-26T20:13:42,995][ERROR][o.e.b.Bootstrap          ] [979804dad51a] node validation exception
      [1] bootstrap checks failed
      [1]: system call filters failed to install; check the logs and fix your configuration or disable system call filters at your own risk
      [2021-07-26T20:13:43,005][INFO ][o.e.n.Node               ] [979804dad51a] stopping ...
      [2021-07-26T20:13:43,162][INFO ][o.e.n.Node               ] [979804dad51a] stopped
      [2021-07-26T20:13:43,162][INFO ][o.e.n.Node               ] [979804dad51a] closing ...
      [2021-07-26T20:13:43,176][INFO ][o.e.n.Node               ] [979804dad51a] closed
      

      This problem is reported as https://github.com/elastic/elasticsearch/issues/26594. ES doesn't support ppc64le officially.
      Referring to a comment in the issue above, I tried to replace jna-4.4.0.jar with the one downloaded from Maven Central, but ES failed with the following error after all.

      [2021-07-27T01:34:07,499][WARN ][o.e.b.JNANatives         ] unable to install syscall filter: 
      java.lang.UnsupportedOperationException: seccomp unavailable: 'ppc64le' architecture unsupported
      	at org.elasticsearch.bootstrap.SystemCallFilter.linuxImpl(SystemCallFilter.java:266) ~[elasticsearch-5.6.14.jar:5.6.14]
      	at org.elasticsearch.bootstrap.SystemCallFilter.init(SystemCallFilter.java:617) ~[elasticsearch-5.6.14.jar:5.6.14]
      	at org.elasticsearch.bootstrap.JNANatives.tryInstallSystemCallFilter(JNANatives.java:258) [elasticsearch-5.6.14.jar:5.6.14]
      	at org.elasticsearch.bootstrap.Natives.tryInstallSystemCallFilter(Natives.java:113) [elasticsearch-5.6.14.jar:5.6.14]
      	at org.elasticsearch.bootstrap.Bootstrap.initializeNatives(Bootstrap.java:111) [elasticsearch-5.6.14.jar:5.6.14]
      	at org.elasticsearch.bootstrap.Bootstrap.setup(Bootstrap.java:195) [elasticsearch-5.6.14.jar:5.6.14]
      	at org.elasticsearch.bootstrap.Bootstrap.init(Bootstrap.java:342) [elasticsearch-5.6.14.jar:5.6.14]
      	at org.elasticsearch.bootstrap.Elasticsearch.init(Elasticsearch.java:132) [elasticsearch-5.6.14.jar:5.6.14]
      	at org.elasticsearch.bootstrap.Elasticsearch.execute(Elasticsearch.java:123) [elasticsearch-5.6.14.jar:5.6.14]
      	at org.elasticsearch.cli.EnvironmentAwareCommand.execute(EnvironmentAwareCommand.java:70) [elasticsearch-5.6.14.jar:5.6.14]
      	at org.elasticsearch.cli.Command.mainWithoutErrorHandling(Command.java:134) [elasticsearch-5.6.14.jar:5.6.14]
      	at org.elasticsearch.cli.Command.main(Command.java:90) [elasticsearch-5.6.14.jar:5.6.14]
      	at org.elasticsearch.bootstrap.Elasticsearch.main(Elasticsearch.java:91) [elasticsearch-5.6.14.jar:5.6.14]
      	at org.elasticsearch.bootstrap.Elasticsearch.main(Elasticsearch.java:84) [elasticsearch-5.6.14.jar:5.6.14]
      

      Patching ES to avoid this problem looks like tough, so disabling system call filter by setting bootstrap.system_call_filter to false at users own risk is an easy workaround.
      https://www.elastic.co/guide/en/elasticsearch/reference/master/_system_call_filter_check.html

      Attachments

        Activity

          People

            sekikn Kengo Seki
            sekikn Kengo Seki
            Votes:
            0 Vote for this issue
            Watchers:
            1 Start watching this issue

            Dates

              Created:
              Updated:
              Resolved:

              Time Tracking

                Estimated:
                Original Estimate - Not Specified
                Not Specified
                Remaining:
                Remaining Estimate - 0h
                0h
                Logged:
                Time Spent - 0.5h
                0.5h