Details

    • Type: Sub-task
    • Status: Resolved
    • Priority: Major
    • Resolution: Invalid
    • Affects Version/s: 1.3.0
    • Fix Version/s: 1.4.0
    • Component/s: build
    • Labels:
      None

      Description

      $ ./gradlew realclean -Pnexus=true -POS=centos-7 -Pprefix=trunk zeppelin-pkg-ind --info
      ...
      [ERROR] error Command failed with exit code 1.
      [INFO] info Visit https://yarnpkg.com/en/docs/cli/install for documentation about this command.
      [INFO] ------------------------------------------------------------------------
      [INFO] Reactor Summary:
      [INFO] 
      [INFO] Zeppelin 0.7.3 ..................................... SUCCESS [ 15.538 s]
      [INFO] Zeppelin: Interpreter .............................. SUCCESS [ 10.359 s]
      [INFO] Zeppelin: Zengine .................................. SUCCESS [  9.427 s]
      [INFO] Zeppelin: Display system apis ...................... SUCCESS [ 17.137 s]
      [INFO] Zeppelin: Spark dependencies ....................... SUCCESS [01:01 min]
      [INFO] Zeppelin: Spark .................................... SUCCESS [ 23.313 s]
      [INFO] Zeppelin: Markdown interpreter ..................... SUCCESS [  1.057 s]
      [INFO] Zeppelin: Angular interpreter ...................... SUCCESS [  0.413 s]
      [INFO] Zeppelin: Shell interpreter ........................ SUCCESS [  0.545 s]
      [INFO] Zeppelin: Livy interpreter ......................... SUCCESS [ 15.926 s]
      [INFO] Zeppelin: HBase interpreter ........................ SUCCESS [  7.852 s]
      [INFO] Zeppelin: Apache Pig Interpreter ................... SUCCESS [ 11.836 s]
      [INFO] Zeppelin: PostgreSQL interpreter ................... SUCCESS [  1.212 s]
      [INFO] Zeppelin: JDBC interpreter ......................... SUCCESS [  1.343 s]
      [INFO] Zeppelin: File System Interpreters ................. SUCCESS [  1.123 s]
      [INFO] Zeppelin: Flink .................................... SUCCESS [ 13.465 s]
      [INFO] Zeppelin: Apache Ignite interpreter ................ SUCCESS [  1.714 s]
      [INFO] Zeppelin: Kylin interpreter ........................ SUCCESS [  0.472 s]
      [INFO] Zeppelin: Python interpreter ....................... SUCCESS [  2.159 s]
      [INFO] Zeppelin: Lens interpreter ......................... SUCCESS [  8.781 s]
      [INFO] Zeppelin: Apache Cassandra interpreter ............. SUCCESS [01:35 min]
      [INFO] Zeppelin: Elasticsearch interpreter ................ SUCCESS [  7.617 s]
      [INFO] Zeppelin: BigQuery interpreter ..................... SUCCESS [ 11.848 s]
      [INFO] Zeppelin: Alluxio interpreter ...................... SUCCESS [  5.398 s]
      [INFO] Zeppelin: Scio ..................................... SUCCESS [01:04 min]
      [INFO] Zeppelin: web Application .......................... FAILURE [01:19 min]
      [INFO] Zeppelin: Server ................................... SKIPPED
      [INFO] Zeppelin: Packaging distribution ................... SKIPPED
      [INFO] Zeppelin: R Interpreter 0.7.3 ...................... SKIPPED
      [INFO] ------------------------------------------------------------------------
      [INFO] BUILD FAILURE
      [INFO] ------------------------------------------------------------------------
      [INFO] Total time: 07:49 min
      [INFO] Finished at: 2019-03-03T23:09:46Z
      [INFO] ------------------------------------------------------------------------
      [ERROR] Failed to execute goal com.github.eirslett:frontend-maven-plugin:1.3:yarn (yarn install) on project zeppelin-web: Failed to run task: 'yarn install --no-lockfile' failed. (error code 1) -> [Help 1]
      [ERROR] 
      [ERROR] To see the full stack trace of the errors, re-run Maven with the -e switch.
      [ERROR] Re-run Maven using the -X switch to enable full debug logging.
      [ERROR] 
      [ERROR] For more information about the errors and possible solutions, please read the following articles:
      [ERROR] [Help 1] http://cwiki.apache.org/confluence/display/MAVEN/MojoFailureException
      [ERROR] 
      [ERROR] After correcting the problems, you can resume the build with the command
      [ERROR]   mvn <goals> -rf :zeppelin-web
      error: Bad exit status from /var/tmp/rpm-tmp.jkF7il (%build)
          Bad exit status from /var/tmp/rpm-tmp.jkF7il (%build)
      
      
      RPM build errors:
      
      > Task :zeppelin-rpm FAILED
      :zeppelin-rpm (Thread[Task worker for ':' Thread 4,5,main]) completed. Took 7 mins 53.414 secs.
      
      FAILURE: Build failed with an exception.
      
      * Where:
      Script '/bigtop/packages.gradle' line: 496
      
      * What went wrong:
      Execution failed for task ':zeppelin-rpm'.
      > Process 'command 'rpmbuild'' finished with non-zero exit value 1
      
      * Try:
      Run with --stacktrace option to get the stack trace. Run with --debug option to get more log output. Run with --scan to get full insights.
      
      * Get more help at https://help.gradle.org
      
      BUILD FAILED11 actionable tasks: 11 executed
       in 8m 17s
      

        Attachments

          Issue Links

            Activity

              People

              • Assignee:
                evans_ye Evans Ye
                Reporter:
                evans_ye Evans Ye
              • Votes:
                0 Vote for this issue
                Watchers:
                1 Start watching this issue

                Dates

                • Created:
                  Updated:
                  Resolved:

                  Time Tracking

                  Estimated:
                  Original Estimate - Not Specified
                  Not Specified
                  Remaining:
                  Remaining Estimate - 0h
                  0h
                  Logged:
                  Time Spent - 10m
                  10m