Details

    • Type: Bug
    • Status: Resolved
    • Priority: Major
    • Resolution: Fixed
    • Affects Version/s: 0.8.0
    • Fix Version/s: 1.0.0
    • Component/s: build
    • Labels:
      None

      Description

      [INFO] -------------------------------------------------------------
      [ERROR] COMPILATION ERROR : 
      [INFO] -------------------------------------------------------------
      [ERROR] /home/olaf/bigtop/output/giraph/giraph-1.1.0/giraph-core/src/main/java/org/apache/giraph/comm/netty/SaslNettyClient.java:[79,24] cannot find symbol
        symbol:   variable SASL_PROPS
        location: class org.apache.hadoop.security.SaslRpcServer
      [ERROR] /home/olaf/bigtop/output/giraph/giraph-1.1.0/giraph-core/src/main/java/org/apache/giraph/comm/netty/SaslNettyServer.java:[97,24] cannot find symbol
        symbol:   variable SASL_PROPS
        location: class org.apache.hadoop.security.SaslRpcServer
      [INFO] 2 errors 
      [INFO] -------------------------------------------------------------
      [INFO] ------------------------------------------------------------------------
      [INFO] Reactor Summary:
      [INFO] 
      [INFO] Apache Giraph Parent .............................. SUCCESS [4.700s]
      [INFO] Apache Giraph Core ................................ FAILURE [7.019s]
      [INFO] Apache Giraph Examples ............................ SKIPPED
      [INFO] Apache Giraph Accumulo I/O ........................ SKIPPED
      [INFO] Apache Giraph HBase I/O ........................... SKIPPED
      [INFO] Apache Giraph HCatalog I/O ........................ SKIPPED
      [INFO] Apache Giraph Hive I/O ............................ SKIPPED
      [INFO] Apache Giraph Gora I/O ............................ SKIPPED
      [INFO] Apache Giraph Rexster I/O ......................... SKIPPED
      [INFO] Apache Giraph Rexster Kibble ...................... SKIPPED
      [INFO] Apache Giraph Rexster I/O Formats ................. SKIPPED
      [INFO] Apache Giraph Distribution ........................ SKIPPED
      [INFO] ------------------------------------------------------------------------
      [INFO] BUILD FAILURE
      [INFO] ------------------------------------------------------------------------
      [INFO] Total time: 12.472s
      [INFO] Finished at: Fri Mar 27 10:35:34 CET 2015
      [INFO] Final Memory: 41M/395M
      [INFO] ------------------------------------------------------------------------
      

        Issue Links

          Activity

          Hide
          warwithin YoungWoo Kim added a comment -

          Packaging rpm and deb works fine on my end.

          Committed. Thanks Evans Ye!

          Show
          warwithin YoungWoo Kim added a comment - Packaging rpm and deb works fine on my end. Committed. Thanks Evans Ye !
          Hide
          warwithin YoungWoo Kim added a comment -

          LGTM!, Running tests for packaging now...

          Show
          warwithin YoungWoo Kim added a comment - LGTM!, Running tests for packaging now...

            People

            • Assignee:
              evans_ye Evans Ye
              Reporter:
              oflebbe Olaf Flebbe
            • Votes:
              0 Vote for this issue
              Watchers:
              2 Start watching this issue

              Dates

              • Created:
                Updated:
                Resolved:

                Development