Details

    • Type: Bug
    • Status: Resolved
    • Priority: Major
    • Resolution: Fixed
    • Affects Version/s: 0.8.0
    • Fix Version/s: 1.0.0
    • Component/s: build
    • Labels:
      None

      Description

      Spark build fails on clean .m2

      [INFO] Spark Project Parent POM .......................... SUCCESS [10.968s]
      [INFO] Spark Project Core ................................ SUCCESS [3:01.197s]
      [INFO] Spark Project Bagel ............................... SUCCESS [23.444s]
      [INFO] Spark Project GraphX .............................. SUCCESS [1:02.773s]
      [INFO] Spark Project ML Library .......................... SUCCESS [53.874s]
      [INFO] Spark Project Streaming ........................... SUCCESS [1:22.051s]
      [INFO] Spark Project Tools ............................... SUCCESS [15.079s]
      [INFO] Spark Project REPL ................................ SUCCESS [51.980s]
      [INFO] Spark Project YARN Parent POM ..................... SUCCESS [1.499s]
      [INFO] Spark Project YARN Stable API ..................... SUCCESS [40.595s]
      [INFO] Spark Project Assembly ............................ FAILURE [45.677s]
      [INFO] Spark Project External Twitter .................... SKIPPED
      [INFO] Spark Project External Kafka ...................... SKIPPED
      [INFO] Spark Project External Flume ...................... SKIPPED
      [INFO] Spark Project External ZeroMQ ..................... SKIPPED
      [INFO] Spark Project External MQTT ....................... SKIPPED
      [INFO] Spark Project Examples ............................ SKIPPED
      [INFO] ------------------------------------------------------------------------
      [INFO] BUILD FAILURE
      [INFO] ------------------------------------------------------------------------
      [INFO] Total time: 9:30.218s
      [INFO] Finished at: Sat Sep 13 22:23:20 EDT 2014
      [INFO] Final Memory: 50M/1057M
      [INFO] ------------------------------------------------------------------------
      [ERROR] Failed to execute goal org.apache.maven.plugins:maven-assembly-plugin:2.4:single (dist) on project spark-assembly_2.10: Execution dist of goal org.apache.maven.plugins:maven-assembly-plugin:2.4:single failed: Plugin org.apache.maven.plugins:maven-assembly-plugin:2.4 or one of its dependencies could not be resolved: Could not find artifact commons-cli:commons-cli:jar:1.2 -> [Help 1]
      [ERROR] 
      

        Activity

        Hide
        plinnell Peter Linnell added a comment -

        +1

        Show
        plinnell Peter Linnell added a comment - +1

          People

          • Assignee:
            rvs Roman Shaposhnik
            Reporter:
            rvs Roman Shaposhnik
          • Votes:
            0 Vote for this issue
            Watchers:
            2 Start watching this issue

            Dates

            • Created:
              Updated:
              Resolved:

              Development