Details

    • Type: Bug
    • Status: Resolved
    • Priority: Critical
    • Resolution: Fixed
    • Affects Version/s: 0.7.0
    • Fix Version/s: 0.8.0
    • Component/s: debian
    • Labels:
      None

      Description

      Debian package build is failing like this:
      http://bigtop01.cloudera.org:8080/job/Bigtop-trunk-Hive/label=precise/624/console
      Relevant piece of log

      23:42:10  bash debian/install_hive.sh \
      23:42:10  	  --prefix=debian/tmp \
      23:42:10  	  --build-dir=build/dist \
      23:42:10  	  --doc-dir=debian/tmp/usr/share/doc/hive
      23:42:11  # We need to get rid of jars that happen to be shipped in other CDH packages
      23:42:11  rm -f debian/tmp/usr/lib/hive/lib/hbase-*.jar debian/tmp/usr/lib/hive/lib/zookeeper-*.jar
      23:42:11  ln -s /usr/lib/hbase/hbase.jar debian/tmp/usr/lib/hive/lib
      23:42:11  ln -s  /usr/lib/zookeeper/zookeeper.jar debian/tmp/usr/lib/hive/lib
      23:42:11  # Workaround for BIGTOP-583
      23:42:11  rm -f debian/tmp/usr/lib/hive/lib/slf4j-log4j12-*.jar
      23:42:11  make[1]: Leaving directory `/mnt/jenkins/workspace/Bigtop-trunk-Hive/label/precise/output/hive/hive-0.13.0.624'
      23:42:12     dh_install
      23:42:12  dh_install: hive missing files (usr/lib/hive/lib/netty-*.jar), aborting
      23:42:12  make: *** [binary] Error 255
      23:42:12  dpkg-buildpackage: error: fakeroot debian/rules binary gave error exit status 2
      23:42:12  debuild: fatal error at line 1350:
      23:42:12  dpkg-buildpackage -rfakeroot -D -us -uc -b failed
      23:42:12  make: *** [/mnt/jenkins/workspace/Bigtop-trunk-Hive/label/precise/build/hive//.deb] Error 29
      23:42:12  Build step 'Execute shell' marked build as failure
      23:42:12  Archiving artifacts
      23:42:23  ERROR: Failed to archive artifacts: output/**/*/*
      

        Issue Links

          Activity

          Hide
          gkesavan Giridharan Kesavan added a comment -

          this patch fixes hive build failure

          Show
          gkesavan Giridharan Kesavan added a comment - this patch fixes hive build failure
          Hide
          cos Konstantin Boudnik added a comment -

          I validated the patch - it works fine! Thank you very much for working on this over the weekend!
          +1 - committing now

          Show
          cos Konstantin Boudnik added a comment - I validated the patch - it works fine! Thank you very much for working on this over the weekend! +1 - committing now
          Hide
          cos Konstantin Boudnik added a comment -

          Committed to the master. Thanks Giri!

          Show
          cos Konstantin Boudnik added a comment - Committed to the master. Thanks Giri!

            People

            • Assignee:
              gkesavan Giridharan Kesavan
              Reporter:
              cos Konstantin Boudnik
            • Votes:
              0 Vote for this issue
              Watchers:
              2 Start watching this issue

              Dates

              • Created:
                Updated:
                Resolved:

                Development