Uploaded image for project: 'Beam'
  1. Beam
  2. BEAM-8036

[beam_PostCommit_SQL] [DataCatalogBigQueryIT > testReadWrite] No such method

Attach filesAttach ScreenshotVotersWatch issueWatchersCreate sub-taskLinkCloneUpdate Comment AuthorReplace String in CommentUpdate Comment VisibilityDelete Comments
    XMLWordPrintableJSON

    Details

      Description

      Use this form to file an issue for test failure:

      Initial investigation:
      09:03:27 >
      Task :sdks:java:extensions:sql:datacatalog:integrationTest
      09:03:27 09:03:27 org.apache.beam.sdk.extensions.sql.meta.provider.datacatalog.DataCatalogBigQueryIT > testReadWrite FAILED*09:03:27* java.lang.NoSuchMethodError at DataCatalogBigQueryIT.java:69*09:03:27* 09:03:27 1 test completed, 1 failed*09:03:28* 09:03:28 >
      Task :sdks:java:extensions:sql:datacatalog:integrationTest
      FAILED*09:03:28* 09:03:28 FAILURE: Build failed with an exception.
       


      After you've filled out the above details, please assign the issue to an individual. Assignee should treat test failures as high-priority, helping to fix the issue or find a more appropriate owner. See Apache Beam Post-Commit Policies.

        Attachments

          Activity

            People

            • Assignee:
              amaliujia Rui Wang
              Reporter:
              Ardagan Mikhail Gryzykhin

              Dates

              • Created:
                Updated:
                Resolved:

                Time Tracking

                Estimated:
                Original Estimate - Not Specified
                Not Specified
                Remaining:
                Remaining Estimate - 0h
                0h
                Logged:
                Time Spent - 2h
                2h

                  Issue deployment