Uploaded image for project: 'Axis2'
  1. Axis2
  2. AXIS2-3781

ComplexDataTypesDocLitBareTest fails

    XMLWordPrintableJSON

    Details

    • Type: Bug
    • Status: Resolved
    • Priority: Blocker
    • Resolution: Fixed
    • Affects Version/s: None
    • Fix Version/s: 1.5.1
    • Component/s: Integration
    • Labels:
      None

      Description

      -------------------------------------------------------------------------------
      Test set: org.apache.axis2.rpc.complex.ComplexDataTypesDocLitBareTest
      -------------------------------------------------------------------------------
      Tests run: 34, Failures: 0, Errors: 11, Skipped: 0, Time elapsed: 75.937 sec <<< FAILURE!
      testretArrayInt1D(org.apache.axis2.rpc.complex.ComplexDataTypesDocLitBareTest) Time elapsed: 2.703 sec <<< ERROR!
      org.apache.axis2.AxisFault: org.apache.axis2.databinding.ADBException: Unsupported type null org.tempuri.complex.data.arrays.ArrayOfint
      at org.apache.axis2.AxisFault.makeFault(AxisFault.java:430)
      at org.tempuri.complex.ComplexDataTypesDocLitBareStub.fromOM(ComplexDataTypesDocLitBareStub.java:48033)
      at org.tempuri.complex.ComplexDataTypesDocLitBareStub.retArrayInt1D(ComplexDataTypesDocLitBareStub.java:4910)
      at org.apache.axis2.rpc.complex.ComplexDataTypesDocLitBareTest.testretArrayInt1D(ComplexDataTypesDocLitBareTest.java:108)
      at sun.reflect.NativeMethodAccessorImpl.invoke0(Native Method)
      at sun.reflect.NativeMethodAccessorImpl.invoke(NativeMethodAccessorImpl.java:39)
      at sun.reflect.DelegatingMethodAccessorImpl.invoke(DelegatingMethodAccessorImpl.java:25)
      at java.lang.reflect.Method.invoke(Method.java:585)
      at junit.framework.TestCase.runTest(TestCase.java:168)
      at junit.framework.TestCase.runBare(TestCase.java:134)
      at junit.framework.TestResult$1.protect(TestResult.java:110)
      at junit.framework.TestResult.runProtected(TestResult.java:128)
      at junit.framework.TestResult.run(TestResult.java:113)
      at junit.framework.TestCase.run(TestCase.java:124)
      at junit.framework.TestSuite.runTest(TestSuite.java:232)
      at junit.framework.TestSuite.run(TestSuite.java:227)
      at junit.extensions.TestDecorator.basicRun(TestDecorator.java:24)
      at junit.extensions.TestSetup$1.protect(TestSetup.java:23)
      at junit.framework.TestResult.runProtected(TestResult.java:128)
      at junit.extensions.TestSetup.run(TestSetup.java:27)
      at org.junit.internal.runners.JUnit38ClassRunner.run(JUnit38ClassRunner.java:81)
      at org.apache.maven.surefire.junit4.JUnit4TestSet.execute(JUnit4TestSet.java:62)
      at org.apache.maven.surefire.suite.AbstractDirectoryTestSuite.executeTestSet(AbstractDirectoryTestSuite.java:140)
      at org.apache.maven.surefire.suite.AbstractDirectoryTestSuite.execute(AbstractDirectoryTestSuite.java:165)
      at org.apache.maven.surefire.Surefire.run(Surefire.java:107)
      at sun.reflect.NativeMethodAccessorImpl.invoke0(Native Method)
      at sun.reflect.NativeMethodAccessorImpl.invoke(NativeMethodAccessorImpl.java:39)
      at sun.reflect.DelegatingMethodAccessorImpl.invoke(DelegatingMethodAccessorImpl.java:25)
      at java.lang.reflect.Method.invoke(Method.java:585)
      at org.apache.maven.surefire.booter.SurefireBooter.runSuitesInProcess(SurefireBooter.java:289)
      at org.apache.maven.surefire.booter.SurefireBooter.main(SurefireBooter.java:993)
      Caused by: java.lang.Exception: org.apache.axis2.databinding.ADBException: Unsupported type null org.tempuri.complex.data.arrays.ArrayOfint
      at org.tempuri.complex.ComplexDataTypesDocLitBareStub$ArrayOfint$Factory.parse(ComplexDataTypesDocLitBareStub.java:40444)
      at org.tempuri.complex.ComplexDataTypesDocLitBareStub$RetArrayInt1DResult$Factory.parse(ComplexDataTypesDocLitBareStub.java:45228)
      at org.tempuri.complex.ComplexDataTypesDocLitBareStub.fromOM(ComplexDataTypesDocLitBareStub.java:48027)
      ... 29 more
      Caused by: org.apache.axis2.databinding.ADBException: Unsupported type null org.tempuri.complex.data.arrays.ArrayOfint
      at org.tempuri.complex.ComplexDataTypesDocLitBareStub$ExtensionMapper.getTypeObject(ComplexDataTypesDocLitBareStub.java:15467)
      at org.tempuri.complex.ComplexDataTypesDocLitBareStub$ArrayOfint$Factory.parse(ComplexDataTypesDocLitBareStub.java:40349)
      ... 31 more

      testretStructSNSAS(org.apache.axis2.rpc.complex.ComplexDataTypesDocLitBareTest) Time elapsed: 2.063 sec <<< ERROR!
      org.apache.axis2.AxisFault: org.apache.axis2.databinding.ADBException: Unsupported type null org.tempuri.complex.data.Group
      at org.apache.axis2.AxisFault.makeFault(AxisFault.java:430)
      at org.tempuri.complex.ComplexDataTypesDocLitBareStub.fromOM(ComplexDataTypesDocLitBareStub.java:48033)
      at org.tempuri.complex.ComplexDataTypesDocLitBareStub.retStructSNSAS(ComplexDataTypesDocLitBareStub.java:4434)
      at org.apache.axis2.rpc.complex.ComplexDataTypesDocLitBareTest.testretStructSNSAS(ComplexDataTypesDocLitBareTest.java:130)
      at sun.reflect.NativeMethodAccessorImpl.invoke0(Native Method)
      at sun.reflect.NativeMethodAccessorImpl.invoke(NativeMethodAccessorImpl.java:39)
      at sun.reflect.DelegatingMethodAccessorImpl.invoke(DelegatingMethodAccessorImpl.java:25)
      at java.lang.reflect.Method.invoke(Method.java:585)
      at junit.framework.TestCase.runTest(TestCase.java:168)
      at junit.framework.TestCase.runBare(TestCase.java:134)
      at junit.framework.TestResult$1.protect(TestResult.java:110)
      at junit.framework.TestResult.runProtected(TestResult.java:128)
      at junit.framework.TestResult.run(TestResult.java:113)
      at junit.framework.TestCase.run(TestCase.java:124)
      at junit.framework.TestSuite.runTest(TestSuite.java:232)
      at junit.framework.TestSuite.run(TestSuite.java:227)
      at junit.extensions.TestDecorator.basicRun(TestDecorator.java:24)
      at junit.extensions.TestSetup$1.protect(TestSetup.java:23)
      at junit.framework.TestResult.runProtected(TestResult.java:128)
      at junit.extensions.TestSetup.run(TestSetup.java:27)
      at org.junit.internal.runners.JUnit38ClassRunner.run(JUnit38ClassRunner.java:81)
      at org.apache.maven.surefire.junit4.JUnit4TestSet.execute(JUnit4TestSet.java:62)
      at org.apache.maven.surefire.suite.AbstractDirectoryTestSuite.executeTestSet(AbstractDirectoryTestSuite.java:140)
      at org.apache.maven.surefire.suite.AbstractDirectoryTestSuite.execute(AbstractDirectoryTestSuite.java:165)
      at org.apache.maven.surefire.Surefire.run(Surefire.java:107)
      at sun.reflect.NativeMethodAccessorImpl.invoke0(Native Method)
      at sun.reflect.NativeMethodAccessorImpl.invoke(NativeMethodAccessorImpl.java:39)
      at sun.reflect.DelegatingMethodAccessorImpl.invoke(DelegatingMethodAccessorImpl.java:25)
      at java.lang.reflect.Method.invoke(Method.java:585)
      at org.apache.maven.surefire.booter.SurefireBooter.runSuitesInProcess(SurefireBooter.java:289)
      at org.apache.maven.surefire.booter.SurefireBooter.main(SurefireBooter.java:993)
      Caused by: java.lang.Exception: org.apache.axis2.databinding.ADBException: Unsupported type null org.tempuri.complex.data.Group
      at org.tempuri.complex.ComplexDataTypesDocLitBareStub$Group$Factory.parse(ComplexDataTypesDocLitBareStub.java:14053)
      at org.tempuri.complex.ComplexDataTypesDocLitBareStub$RetStructSNSASResult$Factory.parse(ComplexDataTypesDocLitBareStub.java:11235)
      at org.tempuri.complex.ComplexDataTypesDocLitBareStub.fromOM(ComplexDataTypesDocLitBareStub.java:47971)
      ... 29 more
      Caused by: org.apache.axis2.databinding.ADBException: Unsupported type null org.tempuri.complex.data.Group
      at org.tempuri.complex.ComplexDataTypesDocLitBareStub$ExtensionMapper.getTypeObject(ComplexDataTypesDocLitBareStub.java:15467)
      at org.tempuri.complex.ComplexDataTypesDocLitBareStub$Group$Factory.parse(ComplexDataTypesDocLitBareStub.java:13969)
      ... 31 more

      testretArrayDateTime1D(org.apache.axis2.rpc.complex.ComplexDataTypesDocLitBareTest) Time elapsed: 2.125 sec <<< ERROR!
      org.apache.axis2.AxisFault: org.apache.axis2.databinding.ADBException: Unsupported type null org.tempuri.complex.data.arrays.ArrayOfNullableOfdateTime
      at org.apache.axis2.AxisFault.makeFault(AxisFault.java:430)
      at org.tempuri.complex.ComplexDataTypesDocLitBareStub.fromOM(ComplexDataTypesDocLitBareStub.java:48033)
      at org.tempuri.complex.ComplexDataTypesDocLitBareStub.retArrayDateTime1D(ComplexDataTypesDocLitBareStub.java:3482)
      at org.apache.axis2.rpc.complex.ComplexDataTypesDocLitBareTest.testretArrayDateTime1D(ComplexDataTypesDocLitBareTest.java:144)
      at sun.reflect.NativeMethodAccessorImpl.invoke0(Native Method)
      at sun.reflect.NativeMethodAccessorImpl.invoke(NativeMethodAccessorImpl.java:39)
      at sun.reflect.DelegatingMethodAccessorImpl.invoke(DelegatingMethodAccessorImpl.java:25)
      at java.lang.reflect.Method.invoke(Method.java:585)
      at junit.framework.TestCase.runTest(TestCase.java:168)
      at junit.framework.TestCase.runBare(TestCase.java:134)
      at junit.framework.TestResult$1.protect(TestResult.java:110)
      at junit.framework.TestResult.runProtected(TestResult.java:128)
      at junit.framework.TestResult.run(TestResult.java:113)
      at junit.framework.TestCase.run(TestCase.java:124)
      at junit.framework.TestSuite.runTest(TestSuite.java:232)
      at junit.framework.TestSuite.run(TestSuite.java:227)
      at junit.extensions.TestDecorator.basicRun(TestDecorator.java:24)
      at junit.extensions.TestSetup$1.protect(TestSetup.java:23)
      at junit.framework.TestResult.runProtected(TestResult.java:128)
      at junit.extensions.TestSetup.run(TestSetup.java:27)
      at org.junit.internal.runners.JUnit38ClassRunner.run(JUnit38ClassRunner.java:81)
      at org.apache.maven.surefire.junit4.JUnit4TestSet.execute(JUnit4TestSet.java:62)
      at org.apache.maven.surefire.suite.AbstractDirectoryTestSuite.executeTestSet(AbstractDirectoryTestSuite.java:140)
      at org.apache.maven.surefire.suite.AbstractDirectoryTestSuite.execute(AbstractDirectoryTestSuite.java:165)
      at org.apache.maven.surefire.Surefire.run(Surefire.java:107)
      at sun.reflect.NativeMethodAccessorImpl.invoke0(Native Method)
      at sun.reflect.NativeMethodAccessorImpl.invoke(NativeMethodAccessorImpl.java:39)
      at sun.reflect.DelegatingMethodAccessorImpl.invoke(DelegatingMethodAccessorImpl.java:25)
      at java.lang.reflect.Method.invoke(Method.java:585)
      at org.apache.maven.surefire.booter.SurefireBooter.runSuitesInProcess(SurefireBooter.java:289)
      at org.apache.maven.surefire.booter.SurefireBooter.main(SurefireBooter.java:993)
      Caused by: java.lang.Exception: org.apache.axis2.databinding.ADBException: Unsupported type null org.tempuri.complex.data.arrays.ArrayOfNullableOfdateTime
      at org.tempuri.complex.ComplexDataTypesDocLitBareStub$ArrayOfNullableOfdateTime$Factory.parse(ComplexDataTypesDocLitBareStub.java:29884)
      at org.tempuri.complex.ComplexDataTypesDocLitBareStub$RetArrayDateTime1DResult$Factory.parse(ComplexDataTypesDocLitBareStub.java:26547)
      at org.tempuri.complex.ComplexDataTypesDocLitBareStub.fromOM(ComplexDataTypesDocLitBareStub.java:47859)
      ... 29 more
      Caused by: org.apache.axis2.databinding.ADBException: Unsupported type null org.tempuri.complex.data.arrays.ArrayOfNullableOfdateTime
      at org.tempuri.complex.ComplexDataTypesDocLitBareStub$ExtensionMapper.getTypeObject(ComplexDataTypesDocLitBareStub.java:15467)
      at org.tempuri.complex.ComplexDataTypesDocLitBareStub$ArrayOfNullableOfdateTime$Factory.parse(ComplexDataTypesDocLitBareStub.java:29789)
      ... 31 more

      testretArrayString2D(org.apache.axis2.rpc.complex.ComplexDataTypesDocLitBareTest) Time elapsed: 2.078 sec <<< ERROR!
      org.apache.axis2.AxisFault: org.apache.axis2.databinding.ADBException: Unsupported type null org.tempuri.complex.data.arrays.ArrayOfArrayOfstring
      at org.apache.axis2.AxisFault.makeFault(AxisFault.java:430)
      at org.tempuri.complex.ComplexDataTypesDocLitBareStub.fromOM(ComplexDataTypesDocLitBareStub.java:48033)
      at org.tempuri.complex.ComplexDataTypesDocLitBareStub.retArrayString2D(ComplexDataTypesDocLitBareStub.java:2173)
      at org.apache.axis2.rpc.complex.ComplexDataTypesDocLitBareTest.testretArrayString2D(ComplexDataTypesDocLitBareTest.java:163)
      at sun.reflect.NativeMethodAccessorImpl.invoke0(Native Method)
      at sun.reflect.NativeMethodAccessorImpl.invoke(NativeMethodAccessorImpl.java:39)
      at sun.reflect.DelegatingMethodAccessorImpl.invoke(DelegatingMethodAccessorImpl.java:25)
      at java.lang.reflect.Method.invoke(Method.java:585)
      at junit.framework.TestCase.runTest(TestCase.java:168)
      at junit.framework.TestCase.runBare(TestCase.java:134)
      at junit.framework.TestResult$1.protect(TestResult.java:110)
      at junit.framework.TestResult.runProtected(TestResult.java:128)
      at junit.framework.TestResult.run(TestResult.java:113)
      at junit.framework.TestCase.run(TestCase.java:124)
      at junit.framework.TestSuite.runTest(TestSuite.java:232)
      at junit.framework.TestSuite.run(TestSuite.java:227)
      at junit.extensions.TestDecorator.basicRun(TestDecorator.java:24)
      at junit.extensions.TestSetup$1.protect(TestSetup.java:23)
      at junit.framework.TestResult.runProtected(TestResult.java:128)
      at junit.extensions.TestSetup.run(TestSetup.java:27)
      at org.junit.internal.runners.JUnit38ClassRunner.run(JUnit38ClassRunner.java:81)
      at org.apache.maven.surefire.junit4.JUnit4TestSet.execute(JUnit4TestSet.java:62)
      at org.apache.maven.surefire.suite.AbstractDirectoryTestSuite.executeTestSet(AbstractDirectoryTestSuite.java:140)
      at org.apache.maven.surefire.suite.AbstractDirectoryTestSuite.execute(AbstractDirectoryTestSuite.java:165)
      at org.apache.maven.surefire.Surefire.run(Surefire.java:107)
      at sun.reflect.NativeMethodAccessorImpl.invoke0(Native Method)
      at sun.reflect.NativeMethodAccessorImpl.invoke(NativeMethodAccessorImpl.java:39)
      at sun.reflect.DelegatingMethodAccessorImpl.invoke(DelegatingMethodAccessorImpl.java:25)
      at java.lang.reflect.Method.invoke(Method.java:585)
      at org.apache.maven.surefire.booter.SurefireBooter.runSuitesInProcess(SurefireBooter.java:289)
      at org.apache.maven.surefire.booter.SurefireBooter.main(SurefireBooter.java:993)
      Caused by: java.lang.Exception: org.apache.axis2.databinding.ADBException: Unsupported type null org.tempuri.complex.data.arrays.ArrayOfArrayOfstring
      at org.tempuri.complex.ComplexDataTypesDocLitBareStub$ArrayOfArrayOfstring$Factory.parse(ComplexDataTypesDocLitBareStub.java:16489)
      at org.tempuri.complex.ComplexDataTypesDocLitBareStub$RetArrayString2DResult$Factory.parse(ComplexDataTypesDocLitBareStub.java:12049)
      at org.tempuri.complex.ComplexDataTypesDocLitBareStub.fromOM(ComplexDataTypesDocLitBareStub.java:47705)
      ... 29 more
      Caused by: org.apache.axis2.databinding.ADBException: Unsupported type null org.tempuri.complex.data.arrays.ArrayOfArrayOfstring
      at org.tempuri.complex.ComplexDataTypesDocLitBareStub$ExtensionMapper.getTypeObject(ComplexDataTypesDocLitBareStub.java:15467)
      at org.tempuri.complex.ComplexDataTypesDocLitBareStub$ArrayOfArrayOfstring$Factory.parse(ComplexDataTypesDocLitBareStub.java:16396)
      ... 31 more

      testretArrayDecimal1D(org.apache.axis2.rpc.complex.ComplexDataTypesDocLitBareTest) Time elapsed: 2.109 sec <<< ERROR!
      org.apache.axis2.AxisFault: org.apache.axis2.databinding.ADBException: Unsupported type null org.tempuri.complex.data.arrays.ArrayOfNullableOfdecimal
      at org.apache.axis2.AxisFault.makeFault(AxisFault.java:430)
      at org.tempuri.complex.ComplexDataTypesDocLitBareStub.fromOM(ComplexDataTypesDocLitBareStub.java:48033)
      at org.tempuri.complex.ComplexDataTypesDocLitBareStub.retArrayDecimal1D(ComplexDataTypesDocLitBareStub.java:1340)
      at org.apache.axis2.rpc.complex.ComplexDataTypesDocLitBareTest.testretArrayDecimal1D(ComplexDataTypesDocLitBareTest.java:179)
      at sun.reflect.NativeMethodAccessorImpl.invoke0(Native Method)
      at sun.reflect.NativeMethodAccessorImpl.invoke(NativeMethodAccessorImpl.java:39)
      at sun.reflect.DelegatingMethodAccessorImpl.invoke(DelegatingMethodAccessorImpl.java:25)
      at java.lang.reflect.Method.invoke(Method.java:585)
      at junit.framework.TestCase.runTest(TestCase.java:168)
      at junit.framework.TestCase.runBare(TestCase.java:134)
      at junit.framework.TestResult$1.protect(TestResult.java:110)
      at junit.framework.TestResult.runProtected(TestResult.java:128)
      at junit.framework.TestResult.run(TestResult.java:113)
      at junit.framework.TestCase.run(TestCase.java:124)
      at junit.framework.TestSuite.runTest(TestSuite.java:232)
      at junit.framework.TestSuite.run(TestSuite.java:227)
      at junit.extensions.TestDecorator.basicRun(TestDecorator.java:24)
      at junit.extensions.TestSetup$1.protect(TestSetup.java:23)
      at junit.framework.TestResult.runProtected(TestResult.java:128)
      at junit.extensions.TestSetup.run(TestSetup.java:27)
      at org.junit.internal.runners.JUnit38ClassRunner.run(JUnit38ClassRunner.java:81)
      at org.apache.maven.surefire.junit4.JUnit4TestSet.execute(JUnit4TestSet.java:62)
      at org.apache.maven.surefire.suite.AbstractDirectoryTestSuite.executeTestSet(AbstractDirectoryTestSuite.java:140)
      at org.apache.maven.surefire.suite.AbstractDirectoryTestSuite.execute(AbstractDirectoryTestSuite.java:165)
      at org.apache.maven.surefire.Surefire.run(Surefire.java:107)
      at sun.reflect.NativeMethodAccessorImpl.invoke0(Native Method)
      at sun.reflect.NativeMethodAccessorImpl.invoke(NativeMethodAccessorImpl.java:39)
      at sun.reflect.DelegatingMethodAccessorImpl.invoke(DelegatingMethodAccessorImpl.java:25)
      at java.lang.reflect.Method.invoke(Method.java:585)
      at org.apache.maven.surefire.booter.SurefireBooter.runSuitesInProcess(SurefireBooter.java:289)
      at org.apache.maven.surefire.booter.SurefireBooter.main(SurefireBooter.java:993)
      Caused by: java.lang.Exception: org.apache.axis2.databinding.ADBException: Unsupported type null org.tempuri.complex.data.arrays.ArrayOfNullableOfdecimal
      at org.tempuri.complex.ComplexDataTypesDocLitBareStub$ArrayOfNullableOfdecimal$Factory.parse(ComplexDataTypesDocLitBareStub.java:28437)
      at org.tempuri.complex.ComplexDataTypesDocLitBareStub$RetArrayDecimal1DResult$Factory.parse(ComplexDataTypesDocLitBareStub.java:9433)
      at org.tempuri.complex.ComplexDataTypesDocLitBareStub.fromOM(ComplexDataTypesDocLitBareStub.java:47607)
      ... 29 more
      Caused by: org.apache.axis2.databinding.ADBException: Unsupported type null org.tempuri.complex.data.arrays.ArrayOfNullableOfdecimal
      at org.tempuri.complex.ComplexDataTypesDocLitBareStub$ExtensionMapper.getTypeObject(ComplexDataTypesDocLitBareStub.java:15467)
      at org.tempuri.complex.ComplexDataTypesDocLitBareStub$ArrayOfNullableOfdecimal$Factory.parse(ComplexDataTypesDocLitBareStub.java:28342)
      ... 31 more

      testretStructSNSA(org.apache.axis2.rpc.complex.ComplexDataTypesDocLitBareTest) Time elapsed: 2.094 sec <<< ERROR!
      org.apache.axis2.AxisFault: org.apache.axis2.databinding.ADBException: Unsupported type null org.tempuri.complex.data.Employee
      at org.apache.axis2.AxisFault.makeFault(AxisFault.java:430)
      at org.tempuri.complex.ComplexDataTypesDocLitBareStub.fromOM(ComplexDataTypesDocLitBareStub.java:48033)
      at org.tempuri.complex.ComplexDataTypesDocLitBareStub.retStructSNSA(ComplexDataTypesDocLitBareStub.java:3125)
      at org.apache.axis2.rpc.complex.ComplexDataTypesDocLitBareTest.testretStructSNSA(ComplexDataTypesDocLitBareTest.java:196)
      at sun.reflect.NativeMethodAccessorImpl.invoke0(Native Method)
      at sun.reflect.NativeMethodAccessorImpl.invoke(NativeMethodAccessorImpl.java:39)
      at sun.reflect.DelegatingMethodAccessorImpl.invoke(DelegatingMethodAccessorImpl.java:25)
      at java.lang.reflect.Method.invoke(Method.java:585)
      at junit.framework.TestCase.runTest(TestCase.java:168)
      at junit.framework.TestCase.runBare(TestCase.java:134)
      at junit.framework.TestResult$1.protect(TestResult.java:110)
      at junit.framework.TestResult.runProtected(TestResult.java:128)
      at junit.framework.TestResult.run(TestResult.java:113)
      at junit.framework.TestCase.run(TestCase.java:124)
      at junit.framework.TestSuite.runTest(TestSuite.java:232)
      at junit.framework.TestSuite.run(TestSuite.java:227)
      at junit.extensions.TestDecorator.basicRun(TestDecorator.java:24)
      at junit.extensions.TestSetup$1.protect(TestSetup.java:23)
      at junit.framework.TestResult.runProtected(TestResult.java:128)
      at junit.extensions.TestSetup.run(TestSetup.java:27)
      at org.junit.internal.runners.JUnit38ClassRunner.run(JUnit38ClassRunner.java:81)
      at org.apache.maven.surefire.junit4.JUnit4TestSet.execute(JUnit4TestSet.java:62)
      at org.apache.maven.surefire.suite.AbstractDirectoryTestSuite.executeTestSet(AbstractDirectoryTestSuite.java:140)
      at org.apache.maven.surefire.suite.AbstractDirectoryTestSuite.execute(AbstractDirectoryTestSuite.java:165)
      at org.apache.maven.surefire.Surefire.run(Surefire.java:107)
      at sun.reflect.NativeMethodAccessorImpl.invoke0(Native Method)
      at sun.reflect.NativeMethodAccessorImpl.invoke(NativeMethodAccessorImpl.java:39)
      at sun.reflect.DelegatingMethodAccessorImpl.invoke(DelegatingMethodAccessorImpl.java:25)
      at java.lang.reflect.Method.invoke(Method.java:585)
      at org.apache.maven.surefire.booter.SurefireBooter.runSuitesInProcess(SurefireBooter.java:289)
      at org.apache.maven.surefire.booter.SurefireBooter.main(SurefireBooter.java:993)
      Caused by: java.lang.Exception: org.apache.axis2.databinding.ADBException: Unsupported type null org.tempuri.complex.data.Employee
      at org.tempuri.complex.ComplexDataTypesDocLitBareStub$Employee$Factory.parse(ComplexDataTypesDocLitBareStub.java:10261)
      at org.tempuri.complex.ComplexDataTypesDocLitBareStub$RetStructSNSAResult$Factory.parse(ComplexDataTypesDocLitBareStub.java:35281)
      at org.tempuri.complex.ComplexDataTypesDocLitBareStub.fromOM(ComplexDataTypesDocLitBareStub.java:47817)
      ... 29 more
      Caused by: org.apache.axis2.databinding.ADBException: Unsupported type null org.tempuri.complex.data.Employee
      at org.tempuri.complex.ComplexDataTypesDocLitBareStub$ExtensionMapper.getTypeObject(ComplexDataTypesDocLitBareStub.java:15467)
      at org.tempuri.complex.ComplexDataTypesDocLitBareStub$Employee$Factory.parse(ComplexDataTypesDocLitBareStub.java:10122)
      ... 31 more

      testretStructSN(org.apache.axis2.rpc.complex.ComplexDataTypesDocLitBareTest) Time elapsed: 2.047 sec <<< ERROR!
      org.apache.axis2.AxisFault: org.apache.axis2.databinding.ADBException: Unsupported type null org.tempuri.complex.data.Person
      at org.apache.axis2.AxisFault.makeFault(AxisFault.java:430)
      at org.tempuri.complex.ComplexDataTypesDocLitBareStub.fromOM(ComplexDataTypesDocLitBareStub.java:48033)
      at org.tempuri.complex.ComplexDataTypesDocLitBareStub.retStructSN(ComplexDataTypesDocLitBareStub.java:3839)
      at org.apache.axis2.rpc.complex.ComplexDataTypesDocLitBareTest.testretStructSN(ComplexDataTypesDocLitBareTest.java:239)
      at sun.reflect.NativeMethodAccessorImpl.invoke0(Native Method)
      at sun.reflect.NativeMethodAccessorImpl.invoke(NativeMethodAccessorImpl.java:39)
      at sun.reflect.DelegatingMethodAccessorImpl.invoke(DelegatingMethodAccessorImpl.java:25)
      at java.lang.reflect.Method.invoke(Method.java:585)
      at junit.framework.TestCase.runTest(TestCase.java:168)
      at junit.framework.TestCase.runBare(TestCase.java:134)
      at junit.framework.TestResult$1.protect(TestResult.java:110)
      at junit.framework.TestResult.runProtected(TestResult.java:128)
      at junit.framework.TestResult.run(TestResult.java:113)
      at junit.framework.TestCase.run(TestCase.java:124)
      at junit.framework.TestSuite.runTest(TestSuite.java:232)
      at junit.framework.TestSuite.run(TestSuite.java:227)
      at junit.extensions.TestDecorator.basicRun(TestDecorator.java:24)
      at junit.extensions.TestSetup$1.protect(TestSetup.java:23)
      at junit.framework.TestResult.runProtected(TestResult.java:128)
      at junit.extensions.TestSetup.run(TestSetup.java:27)
      at org.junit.internal.runners.JUnit38ClassRunner.run(JUnit38ClassRunner.java:81)
      at org.apache.maven.surefire.junit4.JUnit4TestSet.execute(JUnit4TestSet.java:62)
      at org.apache.maven.surefire.suite.AbstractDirectoryTestSuite.executeTestSet(AbstractDirectoryTestSuite.java:140)
      at org.apache.maven.surefire.suite.AbstractDirectoryTestSuite.execute(AbstractDirectoryTestSuite.java:165)
      at org.apache.maven.surefire.Surefire.run(Surefire.java:107)
      at sun.reflect.NativeMethodAccessorImpl.invoke0(Native Method)
      at sun.reflect.NativeMethodAccessorImpl.invoke(NativeMethodAccessorImpl.java:39)
      at sun.reflect.DelegatingMethodAccessorImpl.invoke(DelegatingMethodAccessorImpl.java:25)
      at java.lang.reflect.Method.invoke(Method.java:585)
      at org.apache.maven.surefire.booter.SurefireBooter.runSuitesInProcess(SurefireBooter.java:289)
      at org.apache.maven.surefire.booter.SurefireBooter.main(SurefireBooter.java:993)
      Caused by: java.lang.Exception: org.apache.axis2.databinding.ADBException: Unsupported type null org.tempuri.complex.data.Person
      at org.tempuri.complex.ComplexDataTypesDocLitBareStub$Person$Factory.parse(ComplexDataTypesDocLitBareStub.java:43582)
      at org.tempuri.complex.ComplexDataTypesDocLitBareStub$RetStructSNResult$Factory.parse(ComplexDataTypesDocLitBareStub.java:39404)
      at org.tempuri.complex.ComplexDataTypesDocLitBareStub.fromOM(ComplexDataTypesDocLitBareStub.java:47901)
      ... 29 more
      Caused by: org.apache.axis2.databinding.ADBException: Unsupported type null org.tempuri.complex.data.Person
      at org.tempuri.complex.ComplexDataTypesDocLitBareStub$ExtensionMapper.getTypeObject(ComplexDataTypesDocLitBareStub.java:15467)
      at org.tempuri.complex.ComplexDataTypesDocLitBareStub$Person$Factory.parse(ComplexDataTypesDocLitBareStub.java:43433)
      ... 31 more

      testretArray1DSN(org.apache.axis2.rpc.complex.ComplexDataTypesDocLitBareTest) Time elapsed: 2.094 sec <<< ERROR!
      org.apache.axis2.AxisFault: org.apache.axis2.databinding.ADBException: Unsupported type null org.tempuri.complex.data.arrays.ArrayOfPerson
      at org.apache.axis2.AxisFault.makeFault(AxisFault.java:430)
      at org.tempuri.complex.ComplexDataTypesDocLitBareStub.fromOM(ComplexDataTypesDocLitBareStub.java:48033)
      at org.tempuri.complex.ComplexDataTypesDocLitBareStub.retArray1DSN(ComplexDataTypesDocLitBareStub.java:1578)
      at org.apache.axis2.rpc.complex.ComplexDataTypesDocLitBareTest.testretArray1DSN(ComplexDataTypesDocLitBareTest.java:260)
      at sun.reflect.NativeMethodAccessorImpl.invoke0(Native Method)
      at sun.reflect.NativeMethodAccessorImpl.invoke(NativeMethodAccessorImpl.java:39)
      at sun.reflect.DelegatingMethodAccessorImpl.invoke(DelegatingMethodAccessorImpl.java:25)
      at java.lang.reflect.Method.invoke(Method.java:585)
      at junit.framework.TestCase.runTest(TestCase.java:168)
      at junit.framework.TestCase.runBare(TestCase.java:134)
      at junit.framework.TestResult$1.protect(TestResult.java:110)
      at junit.framework.TestResult.runProtected(TestResult.java:128)
      at junit.framework.TestResult.run(TestResult.java:113)
      at junit.framework.TestCase.run(TestCase.java:124)
      at junit.framework.TestSuite.runTest(TestSuite.java:232)
      at junit.framework.TestSuite.run(TestSuite.java:227)
      at junit.extensions.TestDecorator.basicRun(TestDecorator.java:24)
      at junit.extensions.TestSetup$1.protect(TestSetup.java:23)
      at junit.framework.TestResult.runProtected(TestResult.java:128)
      at junit.extensions.TestSetup.run(TestSetup.java:27)
      at org.junit.internal.runners.JUnit38ClassRunner.run(JUnit38ClassRunner.java:81)
      at org.apache.maven.surefire.junit4.JUnit4TestSet.execute(JUnit4TestSet.java:62)
      at org.apache.maven.surefire.suite.AbstractDirectoryTestSuite.executeTestSet(AbstractDirectoryTestSuite.java:140)
      at org.apache.maven.surefire.suite.AbstractDirectoryTestSuite.execute(AbstractDirectoryTestSuite.java:165)
      at org.apache.maven.surefire.Surefire.run(Surefire.java:107)
      at sun.reflect.NativeMethodAccessorImpl.invoke0(Native Method)
      at sun.reflect.NativeMethodAccessorImpl.invoke(NativeMethodAccessorImpl.java:39)
      at sun.reflect.DelegatingMethodAccessorImpl.invoke(DelegatingMethodAccessorImpl.java:25)
      at java.lang.reflect.Method.invoke(Method.java:585)
      at org.apache.maven.surefire.booter.SurefireBooter.runSuitesInProcess(SurefireBooter.java:289)
      at org.apache.maven.surefire.booter.SurefireBooter.main(SurefireBooter.java:993)
      Caused by: java.lang.Exception: org.apache.axis2.databinding.ADBException: Unsupported type null org.tempuri.complex.data.arrays.ArrayOfPerson
      at org.tempuri.complex.ComplexDataTypesDocLitBareStub$ArrayOfPerson$Factory.parse(ComplexDataTypesDocLitBareStub.java:12672)
      at org.tempuri.complex.ComplexDataTypesDocLitBareStub$RetArray1DSNResult$Factory.parse(ComplexDataTypesDocLitBareStub.java:28813)
      at org.tempuri.complex.ComplexDataTypesDocLitBareStub.fromOM(ComplexDataTypesDocLitBareStub.java:47635)
      ... 29 more
      Caused by: org.apache.axis2.databinding.ADBException: Unsupported type null org.tempuri.complex.data.arrays.ArrayOfPerson
      at org.tempuri.complex.ComplexDataTypesDocLitBareStub$ExtensionMapper.getTypeObject(ComplexDataTypesDocLitBareStub.java:15467)
      at org.tempuri.complex.ComplexDataTypesDocLitBareStub$ArrayOfPerson$Factory.parse(ComplexDataTypesDocLitBareStub.java:12579)
      ... 31 more

      testretDerivedClass(org.apache.axis2.rpc.complex.ComplexDataTypesDocLitBareTest) Time elapsed: 2.062 sec <<< ERROR!
      org.apache.axis2.AxisFault: org.apache.axis2.databinding.ADBException: Unsupported type null org.tempuri.complex.data.Furniture
      at org.apache.axis2.AxisFault.makeFault(AxisFault.java:430)
      at org.tempuri.complex.ComplexDataTypesDocLitBareStub.fromOM(ComplexDataTypesDocLitBareStub.java:48033)
      at org.tempuri.complex.ComplexDataTypesDocLitBareStub.retDerivedClass(ComplexDataTypesDocLitBareStub.java:3601)
      at org.apache.axis2.rpc.complex.ComplexDataTypesDocLitBareTest.testretDerivedClass(ComplexDataTypesDocLitBareTest.java:277)
      at sun.reflect.NativeMethodAccessorImpl.invoke0(Native Method)
      at sun.reflect.NativeMethodAccessorImpl.invoke(NativeMethodAccessorImpl.java:39)
      at sun.reflect.DelegatingMethodAccessorImpl.invoke(DelegatingMethodAccessorImpl.java:25)
      at java.lang.reflect.Method.invoke(Method.java:585)
      at junit.framework.TestCase.runTest(TestCase.java:168)
      at junit.framework.TestCase.runBare(TestCase.java:134)
      at junit.framework.TestResult$1.protect(TestResult.java:110)
      at junit.framework.TestResult.runProtected(TestResult.java:128)
      at junit.framework.TestResult.run(TestResult.java:113)
      at junit.framework.TestCase.run(TestCase.java:124)
      at junit.framework.TestSuite.runTest(TestSuite.java:232)
      at junit.framework.TestSuite.run(TestSuite.java:227)
      at junit.extensions.TestDecorator.basicRun(TestDecorator.java:24)
      at junit.extensions.TestSetup$1.protect(TestSetup.java:23)
      at junit.framework.TestResult.runProtected(TestResult.java:128)
      at junit.extensions.TestSetup.run(TestSetup.java:27)
      at org.junit.internal.runners.JUnit38ClassRunner.run(JUnit38ClassRunner.java:81)
      at org.apache.maven.surefire.junit4.JUnit4TestSet.execute(JUnit4TestSet.java:62)
      at org.apache.maven.surefire.suite.AbstractDirectoryTestSuite.executeTestSet(AbstractDirectoryTestSuite.java:140)
      at org.apache.maven.surefire.suite.AbstractDirectoryTestSuite.execute(AbstractDirectoryTestSuite.java:165)
      at org.apache.maven.surefire.Surefire.run(Surefire.java:107)
      at sun.reflect.NativeMethodAccessorImpl.invoke0(Native Method)
      at sun.reflect.NativeMethodAccessorImpl.invoke(NativeMethodAccessorImpl.java:39)
      at sun.reflect.DelegatingMethodAccessorImpl.invoke(DelegatingMethodAccessorImpl.java:25)
      at java.lang.reflect.Method.invoke(Method.java:585)
      at org.apache.maven.surefire.booter.SurefireBooter.runSuitesInProcess(SurefireBooter.java:289)
      at org.apache.maven.surefire.booter.SurefireBooter.main(SurefireBooter.java:993)
      Caused by: java.lang.Exception: org.apache.axis2.databinding.ADBException: Unsupported type null org.tempuri.complex.data.Furniture
      at org.tempuri.complex.ComplexDataTypesDocLitBareStub$Furniture$Factory.parse(ComplexDataTypesDocLitBareStub.java:10859)
      at org.tempuri.complex.ComplexDataTypesDocLitBareStub$RetDerivedClassResult$Factory.parse(ComplexDataTypesDocLitBareStub.java:6986)
      at org.tempuri.complex.ComplexDataTypesDocLitBareStub.fromOM(ComplexDataTypesDocLitBareStub.java:47873)
      ... 29 more
      Caused by: org.apache.axis2.databinding.ADBException: Unsupported type null org.tempuri.complex.data.Furniture
      at org.tempuri.complex.ComplexDataTypesDocLitBareStub$ExtensionMapper.getTypeObject(ComplexDataTypesDocLitBareStub.java:15467)
      at org.tempuri.complex.ComplexDataTypesDocLitBareStub$Furniture$Factory.parse(ComplexDataTypesDocLitBareStub.java:10768)
      ... 31 more

      testretStructS1(org.apache.axis2.rpc.complex.ComplexDataTypesDocLitBareTest) Time elapsed: 2.047 sec <<< ERROR!
      org.apache.axis2.AxisFault: org.apache.axis2.databinding.ADBException: Unsupported type null org.tempuri.complex.data.Name
      at org.apache.axis2.AxisFault.makeFault(AxisFault.java:430)
      at org.tempuri.complex.ComplexDataTypesDocLitBareStub.fromOM(ComplexDataTypesDocLitBareStub.java:48033)
      at org.tempuri.complex.ComplexDataTypesDocLitBareStub.retStructS1(ComplexDataTypesDocLitBareStub.java:4196)
      at org.apache.axis2.rpc.complex.ComplexDataTypesDocLitBareTest.testretStructS1(ComplexDataTypesDocLitBareTest.java:320)
      at sun.reflect.NativeMethodAccessorImpl.invoke0(Native Method)
      at sun.reflect.NativeMethodAccessorImpl.invoke(NativeMethodAccessorImpl.java:39)
      at sun.reflect.DelegatingMethodAccessorImpl.invoke(DelegatingMethodAccessorImpl.java:25)
      at java.lang.reflect.Method.invoke(Method.java:585)
      at junit.framework.TestCase.runTest(TestCase.java:168)
      at junit.framework.TestCase.runBare(TestCase.java:134)
      at junit.framework.TestResult$1.protect(TestResult.java:110)
      at junit.framework.TestResult.runProtected(TestResult.java:128)
      at junit.framework.TestResult.run(TestResult.java:113)
      at junit.framework.TestCase.run(TestCase.java:124)
      at junit.framework.TestSuite.runTest(TestSuite.java:232)
      at junit.framework.TestSuite.run(TestSuite.java:227)
      at junit.extensions.TestDecorator.basicRun(TestDecorator.java:24)
      at junit.extensions.TestSetup$1.protect(TestSetup.java:23)
      at junit.framework.TestResult.runProtected(TestResult.java:128)
      at junit.extensions.TestSetup.run(TestSetup.java:27)
      at org.junit.internal.runners.JUnit38ClassRunner.run(JUnit38ClassRunner.java:81)
      at org.apache.maven.surefire.junit4.JUnit4TestSet.execute(JUnit4TestSet.java:62)
      at org.apache.maven.surefire.suite.AbstractDirectoryTestSuite.executeTestSet(AbstractDirectoryTestSuite.java:140)
      at org.apache.maven.surefire.suite.AbstractDirectoryTestSuite.execute(AbstractDirectoryTestSuite.java:165)
      at org.apache.maven.surefire.Surefire.run(Surefire.java:107)
      at sun.reflect.NativeMethodAccessorImpl.invoke0(Native Method)
      at sun.reflect.NativeMethodAccessorImpl.invoke(NativeMethodAccessorImpl.java:39)
      at sun.reflect.DelegatingMethodAccessorImpl.invoke(DelegatingMethodAccessorImpl.java:25)
      at java.lang.reflect.Method.invoke(Method.java:585)
      at org.apache.maven.surefire.booter.SurefireBooter.runSuitesInProcess(SurefireBooter.java:289)
      at org.apache.maven.surefire.booter.SurefireBooter.main(SurefireBooter.java:993)
      Caused by: java.lang.Exception: org.apache.axis2.databinding.ADBException: Unsupported type null org.tempuri.complex.data.Name
      at org.tempuri.complex.ComplexDataTypesDocLitBareStub$Name$Factory.parse(ComplexDataTypesDocLitBareStub.java:24680)
      at org.tempuri.complex.ComplexDataTypesDocLitBareStub$RetStructS1Result$Factory.parse(ComplexDataTypesDocLitBareStub.java:31110)
      at org.tempuri.complex.ComplexDataTypesDocLitBareStub.fromOM(ComplexDataTypesDocLitBareStub.java:47943)
      ... 29 more
      Caused by: org.apache.axis2.databinding.ADBException: Unsupported type null org.tempuri.complex.data.Name
      at org.tempuri.complex.ComplexDataTypesDocLitBareStub$ExtensionMapper.getTypeObject(ComplexDataTypesDocLitBareStub.java:15467)
      at org.tempuri.complex.ComplexDataTypesDocLitBareStub$Name$Factory.parse(ComplexDataTypesDocLitBareStub.java:24620)
      ... 31 more

      testretArrayString1D(org.apache.axis2.rpc.complex.ComplexDataTypesDocLitBareTest) Time elapsed: 2.047 sec <<< ERROR!
      org.apache.axis2.AxisFault: org.apache.axis2.databinding.ADBException: Unsupported type null org.tempuri.complex.data.arrays.ArrayOfstring
      at org.apache.axis2.AxisFault.makeFault(AxisFault.java:430)
      at org.tempuri.complex.ComplexDataTypesDocLitBareStub.fromOM(ComplexDataTypesDocLitBareStub.java:48033)
      at org.tempuri.complex.ComplexDataTypesDocLitBareStub.retArrayString1D(ComplexDataTypesDocLitBareStub.java:1816)
      at org.apache.axis2.rpc.complex.ComplexDataTypesDocLitBareTest.testretArrayString1D(ComplexDataTypesDocLitBareTest.java:333)
      at sun.reflect.NativeMethodAccessorImpl.invoke0(Native Method)
      at sun.reflect.NativeMethodAccessorImpl.invoke(NativeMethodAccessorImpl.java:39)
      at sun.reflect.DelegatingMethodAccessorImpl.invoke(DelegatingMethodAccessorImpl.java:25)
      at java.lang.reflect.Method.invoke(Method.java:585)
      at junit.framework.TestCase.runTest(TestCase.java:168)
      at junit.framework.TestCase.runBare(TestCase.java:134)
      at junit.framework.TestResult$1.protect(TestResult.java:110)
      at junit.framework.TestResult.runProtected(TestResult.java:128)
      at junit.framework.TestResult.run(TestResult.java:113)
      at junit.framework.TestCase.run(TestCase.java:124)
      at junit.framework.TestSuite.runTest(TestSuite.java:232)
      at junit.framework.TestSuite.run(TestSuite.java:227)
      at junit.extensions.TestDecorator.basicRun(TestDecorator.java:24)
      at junit.extensions.TestSetup$1.protect(TestSetup.java:23)
      at junit.framework.TestResult.runProtected(TestResult.java:128)
      at junit.extensions.TestSetup.run(TestSetup.java:27)
      at org.junit.internal.runners.JUnit38ClassRunner.run(JUnit38ClassRunner.java:81)
      at org.apache.maven.surefire.junit4.JUnit4TestSet.execute(JUnit4TestSet.java:62)
      at org.apache.maven.surefire.suite.AbstractDirectoryTestSuite.executeTestSet(AbstractDirectoryTestSuite.java:140)
      at org.apache.maven.surefire.suite.AbstractDirectoryTestSuite.execute(AbstractDirectoryTestSuite.java:165)
      at org.apache.maven.surefire.Surefire.run(Surefire.java:107)
      at sun.reflect.NativeMethodAccessorImpl.invoke0(Native Method)
      at sun.reflect.NativeMethodAccessorImpl.invoke(NativeMethodAccessorImpl.java:39)
      at sun.reflect.DelegatingMethodAccessorImpl.invoke(DelegatingMethodAccessorImpl.java:25)
      at java.lang.reflect.Method.invoke(Method.java:585)
      at org.apache.maven.surefire.booter.SurefireBooter.runSuitesInProcess(SurefireBooter.java:289)
      at org.apache.maven.surefire.booter.SurefireBooter.main(SurefireBooter.java:993)
      Caused by: java.lang.Exception: org.apache.axis2.databinding.ADBException: Unsupported type null org.tempuri.complex.data.arrays.ArrayOfstring
      at org.tempuri.complex.ComplexDataTypesDocLitBareStub$ArrayOfstring$Factory.parse(ComplexDataTypesDocLitBareStub.java:22949)
      at org.tempuri.complex.ComplexDataTypesDocLitBareStub$RetArrayString1DResult$Factory.parse(ComplexDataTypesDocLitBareStub.java:25550)
      at org.tempuri.complex.ComplexDataTypesDocLitBareStub.fromOM(ComplexDataTypesDocLitBareStub.java:47663)
      ... 29 more
      Caused by: org.apache.axis2.databinding.ADBException: Unsupported type null org.tempuri.complex.data.arrays.ArrayOfstring
      at org.tempuri.complex.ComplexDataTypesDocLitBareStub$ExtensionMapper.getTypeObject(ComplexDataTypesDocLitBareStub.java:15467)
      at org.tempuri.complex.ComplexDataTypesDocLitBareStub$ArrayOfstring$Factory.parse(ComplexDataTypesDocLitBareStub.java:22855)
      ... 31 more

        Attachments

          Activity

            People

            • Assignee:
              dims Davanum Srinivas
              Reporter:
              dims Davanum Srinivas
            • Votes:
              0 Vote for this issue
              Watchers:
              0 Start watching this issue

              Dates

              • Created:
                Updated:
                Resolved: