Uploaded image for project: 'Apache Arrow'
  1. Apache Arrow
  2. ARROW-8914

[C++][Gandiva] Decimal128 related test failed on big-endian platforms

    XMLWordPrintableJSON

Details

    • Improvement
    • Status: Resolved
    • Minor
    • Resolution: Fixed
    • None
    • 1.0.0
    • C++

    Description

      These test failures in gandiva tests occur on big-endian platforms. An example from https://travis-ci.org/github/apache/arrow/jobs/690006107#L2306

      ...
      [==========] 17 tests from 1 test case ran. (2334 ms total)
      [  PASSED  ] 7 tests.
      [  FAILED  ] 10 tests, listed below:
      [  FAILED  ] TestDecimal.TestSimple
      [  FAILED  ] TestDecimal.TestLiteral
      [  FAILED  ] TestDecimal.TestCompare
      [  FAILED  ] TestDecimal.TestRoundFunctions
      [  FAILED  ] TestDecimal.TestCastFunctions
      [  FAILED  ] TestDecimal.TestIsDistinct
      [  FAILED  ] TestDecimal.TestCastVarCharDecimal
      [  FAILED  ] TestDecimal.TestCastDecimalVarChar
      [  FAILED  ] TestDecimal.TestVarCharDecimalNestedCast
      [  FAILED  ] TestDecimal.TestCastDecimalOverflow
      ...
      

      Attachments

        Issue Links

          Activity

            People

              kiszk Kazuaki Ishizaki
              kiszk Kazuaki Ishizaki
              Votes:
              0 Vote for this issue
              Watchers:
              1 Start watching this issue

              Dates

                Created:
                Updated:
                Resolved:

                Time Tracking

                  Estimated:
                  Original Estimate - Not Specified
                  Not Specified
                  Remaining:
                  Remaining Estimate - 0h
                  0h
                  Logged:
                  Time Spent - 1h
                  1h