Uploaded image for project: 'Apache Arrow'
  1. Apache Arrow
  2. ARROW-6440

[CI][Crossbow] Nightly ubuntu, debian, and centos package builds fail

    XMLWordPrintableJSON

    Details

      Description

      See

      The failures look like:

         dh_install
      dh_install: Cannot find (any matches for) "usr/bin/plasma_store_server" (tried in ., debian/tmp)
      dh_install: plasma-store-server missing files: usr/bin/plasma_store_server
      dh_install: missing files, aborting
      make: *** [debian/rules:14: binary] Error 25
      dpkg-buildpackage: error: fakeroot debian/rules binary subprocess returned exit status 2
      debuild: fatal error at line 1152:
      dpkg-buildpackage -rfakeroot -us -uc -ui failed
      Failed debuild -us -uc
      rake aborted!
      

        Attachments

          Issue Links

            Activity

              People

              • Assignee:
                kou Kouhei Sutou
                Reporter:
                npr Neal Richardson
              • Votes:
                0 Vote for this issue
                Watchers:
                2 Start watching this issue

                Dates

                • Created:
                  Updated:
                  Resolved:

                  Time Tracking

                  Estimated:
                  Original Estimate - Not Specified
                  Not Specified
                  Remaining:
                  Remaining Estimate - 0h
                  0h
                  Logged:
                  Time Spent - 1h 10m
                  1h 10m