Uploaded image for project: 'Apache Arrow'
  1. Apache Arrow
  2. ARROW-5769

[Java] org.apache.arrow.flight.TestTls is failed via dev/release/00-prepare.sh

    XMLWordPrintableJSON

    Details

    • Type: Test
    • Status: Resolved
    • Priority: Blocker
    • Resolution: Fixed
    • Affects Version/s: None
    • Fix Version/s: 0.14.0
    • Component/s: Java

      Description

      Details:

      [INFO] [INFO] Running org.apache.arrow.flight.TestTls
      [INFO] [ERROR] Tests run: 3, Failures: 0, Errors: 3, Skipped: 0, Time elapsed: 0.005 s <<< FAILURE! - in org.apache.arrow.flight.TestTls
      [INFO] [ERROR] connectTls(org.apache.arrow.flight.TestTls)  Time elapsed: 0.004 s  <<< ERROR!
      [INFO] java.lang.RuntimeException: java.io.FileNotFoundException: /home/kou/work/cpp/arrow.pravindra/java/flight/../../testing/data/flight/cert0.pem (No such file or directory)
      [INFO] 	at org.apache.arrow.flight.TestTls.lambda$test$3(TestTls.java:105)
      [INFO] 	at org.apache.arrow.flight.TestTls.test(TestTls.java:98)
      [INFO] 	at org.apache.arrow.flight.TestTls.connectTls(TestTls.java:44)
      [INFO] Caused by: java.io.FileNotFoundException: /home/kou/work/cpp/arrow.pravindra/java/flight/../../testing/data/flight/cert0.pem (No such file or directory)
      [INFO] 	at org.apache.arrow.flight.TestTls.lambda$test$3(TestTls.java:102)
      [INFO] 	at org.apache.arrow.flight.TestTls.test(TestTls.java:98)
      [INFO] 	at org.apache.arrow.flight.TestTls.connectTls(TestTls.java:44)
      [INFO] 
      [INFO] [ERROR] rejectInvalidCert(org.apache.arrow.flight.TestTls)  Time elapsed: 0 s  <<< ERROR!
      [INFO] java.lang.Exception: Unexpected exception, expected<io.grpc.StatusRuntimeException> but was<java.lang.RuntimeException>
      [INFO] 	at org.apache.arrow.flight.TestTls.lambda$test$3(TestTls.java:105)
      [INFO] 	at org.apache.arrow.flight.TestTls.test(TestTls.java:98)
      [INFO] 	at org.apache.arrow.flight.TestTls.rejectInvalidCert(TestTls.java:62)
      [INFO] Caused by: java.io.FileNotFoundException: /home/kou/work/cpp/arrow.pravindra/java/flight/../../testing/data/flight/cert0.pem (No such file or directory)
      [INFO] 	at org.apache.arrow.flight.TestTls.lambda$test$3(TestTls.java:102)
      [INFO] 	at org.apache.arrow.flight.TestTls.test(TestTls.java:98)
      [INFO] 	at org.apache.arrow.flight.TestTls.rejectInvalidCert(TestTls.java:62)
      [INFO] 
      [INFO] [ERROR] rejectHostname(org.apache.arrow.flight.TestTls)  Time elapsed: 0.001 s  <<< ERROR!
      [INFO] java.lang.Exception: Unexpected exception, expected<io.grpc.StatusRuntimeException> but was<java.lang.RuntimeException>
      [INFO] 	at org.apache.arrow.flight.TestTls.lambda$test$3(TestTls.java:105)
      [INFO] 	at org.apache.arrow.flight.TestTls.test(TestTls.java:98)
      [INFO] 	at org.apache.arrow.flight.TestTls.rejectHostname(TestTls.java:78)
      [INFO] Caused by: java.io.FileNotFoundException: /home/kou/work/cpp/arrow.pravindra/java/flight/../../testing/data/flight/cert0.pem (No such file or directory)
      [INFO] 	at org.apache.arrow.flight.TestTls.lambda$test$3(TestTls.java:102)
      [INFO] 	at org.apache.arrow.flight.TestTls.test(TestTls.java:98)
      [INFO] 	at org.apache.arrow.flight.TestTls.rejectHostname(TestTls.java:78)
      [INFO] 
      [INFO] [INFO] Running org.apache.arrow.flight.TestServerOptions
      [INFO] [INFO] Tests run: 1, Failures: 0, Errors: 0, Skipped: 0, Time elapsed: 0.114 s - in org.apache.arrow.flight.TestServerOptions
      [INFO] [INFO] 
      [INFO] [INFO] Results:
      [INFO] [INFO] 
      [INFO] [ERROR] Errors: 
      [INFO] [ERROR]   TestTls.connectTls:44->test:98->lambda$test$3:105 Runtime java.io.FileNotFound...
      [INFO] [ERROR]   TestTls.rejectHostname »  Unexpected exception, expected<io.grpc.StatusRuntime...
      [INFO] [ERROR]   TestTls.rejectInvalidCert »  Unexpected exception, expected<io.grpc.StatusRunt...
      [INFO] [INFO] 
      [INFO] [ERROR] Tests run: 27, Failures: 0, Errors: 3, Skipped: 10
      

      I'm not sure whether this is my environment problem or not.

        Attachments

          Issue Links

            Activity

              People

              • Assignee:
                kou Kouhei Sutou
                Reporter:
                kou Kouhei Sutou
              • Votes:
                0 Vote for this issue
                Watchers:
                2 Start watching this issue

                Dates

                • Created:
                  Updated:
                  Resolved:

                  Time Tracking

                  Estimated:
                  Original Estimate - Not Specified
                  Not Specified
                  Remaining:
                  Remaining Estimate - 0h
                  0h
                  Logged:
                  Time Spent - 40m
                  40m