Uploaded image for project: 'Ambari'
  1. Ambari
  2. AMBARI-25584

build failed on AArch64, Fedora 33

    XMLWordPrintableJSON

    Details

    • Type: Bug
    • Status: Open
    • Priority: Minor
    • Resolution: Unresolved
    • Affects Version/s: None
    • Fix Version/s: None
    • Component/s: None
    • Labels:
      None

      Description

      ...
      [INFO] Ambari Main 3.0.0.0-SNAPSHOT ....................... SUCCESS [ 8.042 s]
      [INFO] Apache Ambari Project POM .......................... SUCCESS [ 0.183 s]
      [INFO] Ambari Web ......................................... FAILURE [ 44.714 s]
      [INFO] Ambari Views ....................................... SKIPPED
      [INFO] Ambari Admin View .................................. SKIPPED
      [INFO] ambari-utility ..................................... SKIPPED
      [INFO] Ambari Server SPI .................................. SKIPPED
      [INFO] Ambari Service Advisor 1.0.0.0-SNAPSHOT ............ SKIPPED
      [INFO] Ambari Server ...................................... SKIPPED
      [INFO] Ambari Functional Tests ............................ SKIPPED
      [INFO] Ambari Agent 3.0.0.0-SNAPSHOT ...................... SKIPPED
      [INFO] ------------------------------------------------------------------------
      [INFO] BUILD FAILURE
      [INFO] ------------------------------------------------------------------------
      [INFO] Total time: 54.282 s
      [INFO] Finished at: 2020-11-13T15:17:50+01:00
      [INFO] ------------------------------------------------------------------------
      [ERROR] Failed to execute goal com.github.eirslett:frontend-maven-plugin:1.4:yarn (yarn install) on project ambari-web: Failed to run task: 'yarn install --ignore-engines --pure-lockfile --https-proxy=http://62.244.109.33:8080 --proxy=http://62.244.109.33:8080' failed. org.apache.commons.exec.ExecuteException: Process exited with an error: 1 (Exit value: 1) -> [Help 1]
      [ERROR]
      [ERROR] To see the full stack trace of the errors, re-run Maven with the -e switch.
      [ERROR] Re-run Maven using the -X switch to enable full debug logging.
      [ERROR]
      [ERROR] For more information about the errors and possible solutions, please read the following articles:
      [ERROR] [Help 1] http://cwiki.apache.org/confluence/display/MAVEN/MojoFailureException
      [ERROR]
      [ERROR] After correcting the problems, you can resume the build with the command
      [ERROR] mvn <goals> -rf :ambari-web

        Attachments

          Activity

            People

            • Assignee:
              Unassigned
              Reporter:
              LutzWeischerFujitsu Lutz Weischer
            • Votes:
              0 Vote for this issue
              Watchers:
              1 Start watching this issue

              Dates

              • Created:
                Updated: