Uploaded image for project: 'Ambari'
  1. Ambari
  2. AMBARI-24759

Ambari Server test failures with JDK11

    XMLWordPrintableJSON

    Details

    • Type: Bug
    • Status: In Progress
    • Priority: Major
    • Resolution: Unresolved
    • Affects Version/s: 2.7.1
    • Fix Version/s: 2.8.0
    • Component/s: None

      Description

      Ambari Server tests failures prevent build with JDK11:

      
      ± % JAVA_HOME=/tmp/jdk-11 mvn clean test -Drat.skip=true -am -pl ambari-server -DskipPythonTests=true
      
      ...
      ...
      [ERROR]   ViewThrottleFilterTest.initializationError ? Objenesis java.lang.reflect.Invoc...
      [ERROR]   DataStoreImplTest.initializationError ? Objenesis java.lang.reflect.Invocation...
      [INFO]
      [ERROR] Tests run: 4651, Failures: 0, Errors: 62, Skipped: 71
      [INFO]
      [INFO] ------------------------------------------------------------------------
      [INFO] Reactor Summary:
      [INFO]
      [INFO] Ambari Main ........................................ SUCCESS [  2.216 s]
      [INFO] Apache Ambari Project POM .......................... SUCCESS [  0.008 s]
      [INFO] Ambari Views ....................................... SUCCESS [ 57.359 s]
      [INFO] ambari-utility ..................................... SUCCESS [  4.158 s]
      [INFO] Ambari Server SPI .................................. SUCCESS [  1.341 s]
      [INFO] Ambari Service Advisor ............................. SUCCESS [  0.355 s]
      [INFO] Ambari Server ...................................... FAILURE [20:17 min]
      [INFO] ------------------------------------------------------------------------
      [INFO] BUILD FAILURE
      [INFO] ------------------------------------------------------------------------
      [INFO] Total time: 21:23 min
      [INFO] Finished at: 2018-10-10T15:01:04+00:00
      [INFO] Final Memory: 133M/494M
      [INFO] ------------------------------------------------------------------------
      
      

        Attachments

          Issue Links

            Activity

              People

              • Assignee:
                gboros Gabor Boros
                Reporter:
                gboros Gabor Boros
              • Votes:
                0 Vote for this issue
                Watchers:
                2 Start watching this issue

                Dates

                • Created:
                  Updated:

                  Time Tracking

                  Estimated:
                  Original Estimate - Not Specified
                  Not Specified
                  Remaining:
                  Remaining Estimate - 0h
                  0h
                  Logged:
                  Time Spent - 1h 40m
                  1h 40m