Uploaded image for project: 'Accumulo'
  1. Accumulo
  2. ACCUMULO-4387

Javadoc build failed

    XMLWordPrintableJSON

    Details

    • Type: Bug
    • Status: Resolved
    • Priority: Major
    • Resolution: Fixed
    • Affects Version/s: None
    • Fix Version/s: 1.8.0
    • Component/s: None
    • Labels:
      None

      Description

      While looking at the jenkins build for a PR I noticed that the javadoc build failed. I am going to run the same build command as jenkins and fix this issue.

      [ERROR] Failed to execute goal org.apache.maven.plugins:maven-javadoc-plugin:2.10.3:jar (default-cli) on project accumulo-master: MavenReportException: Error while generating Javadoc:
      [ERROR] Exit code: 1 - /home/jenkins/jenkins-slave/workspace/Accumulo-Pull-Requests/server/master/src/main/java/org/apache/accumulo/master/MasterTime.java:64: error: unknown tag: returns
      [ERROR] * @returns Approximate total duration this cluster has had a Master, in milliseconds.
      

        Attachments

          Activity

            People

            • Assignee:
              kturner Keith Turner
              Reporter:
              kturner Keith Turner
            • Votes:
              0 Vote for this issue
              Watchers:
              2 Start watching this issue

              Dates

              • Created:
                Updated:
                Resolved:

                Time Tracking

                Estimated:
                Original Estimate - Not Specified
                Not Specified
                Remaining:
                Remaining Estimate - 0h
                0h
                Logged:
                Time Spent - 20m
                20m